program: Gaussian 09
title: 000092399
version: EM64L-G09RevD.01
frameworkgroup: C1[X(C10H11Cl3)]
method: RPBEPBE
basis: SDD
operation: Freq
keyword: #p
keyword: freq=noraman
keyword: PBEPBE/SDD
title: #p freq=noraman PBEPBE/SDD
converged: YES YES NO NO
title: Mulliken charges:
elementType: Cl Cl Cl C C C C C C C C C C H H H H H H H H H H H
charge: -0.009500 -0.002316 -0.055314 -0.235511 0.762707 -0.687854 -0.686836 -0.449086 -0.410008 0.599192 -0.249518 -0.375136 -0.778709 0.235514 0.212087 0.219878 0.232109 0.232193 0.219699 0.213033 0.266200 0.251938 0.251952 0.243286
chargesum: 0.00000
title: Mulliken charges with hydrogens summed into heavy atoms:
elementType: Cl Cl Cl C C C C C C C C C C
charge: -0.009500 -0.002316 -0.055314 0.000004 0.762707 -0.023780 -0.021911 -0.449086 -0.143808 0.599192 -0.249518 -0.375136 -0.031534
polarizability: 1.70294264e+02 2.30149019e+00 1.65530790e+02 -6.23022496e-02 2.29072270e-02 7.59961977e+01
1716.lowfreq: -17.5902 0.0005 0.0016 0.0020 2.9871 7.5536 12.7946 62.7772 85.4998
frequency: -12.0083 62.7623 85.4836 101.3163 109.3181 148.4907 202.4561 212.8255 217.2980 238.2827 248.1759 271.1945 284.6961 299.2573 315.8873 373.3658 402.0453 411.4877 478.9146 542.2910 551.0685 589.7266 632.8203 732.1839 740.7966 758.1697 868.4501 886.7147 923.7757 928.1950 957.5769 1012.4206 1042.9114 1063.0561 1080.7427 1115.7629 1160.7257 1219.1578 1245.3660 1304.3275 1316.8490 1353.2313 1363.6612 1380.7137 1399.9733 1403.1945 1436.3132 1462.8762 1467.0345 1468.4229 1468.7807 1480.7425 1488.0604 1537.8297 1593.9768 2977.3499 2979.3795 2996.6334 3032.1819 3070.3613 3073.5626 3080.4569 3082.3440 3086.3027 3124.1379 3165.7931
redmass: 2.7696 7.9098 1.3789 2.8593 3.0549 4.1119 10.2842 17.5678 1.0939 3.5471 1.1580 2.9617 5.1963 3.7314 12.3291 8.7281 4.9006 2.8586 4.3288 5.2621 5.8203 3.6223 5.6734 4.1498 4.3210 8.4107 3.7158 1.5018 1.1908 3.3230 1.4216 1.5227 1.4845 3.6457 1.7619 2.6833 2.0475 1.6437 5.6328 2.4531 1.3058 7.7598 2.0399 1.1880 1.2174 1.2382 3.2027 1.1899 1.0477 1.0443 1.0465 1.0494 1.0802 4.8859 8.9752 1.0351 1.0357 1.0382 1.0849 1.1000 1.0975 1.0981 1.1006 1.0999 1.0981 1.0916
irintensity: 0.0026 0.7953 0.0035 1.1282 0.2849 0.3985 1.1472 0.1270 0.0908 2.1466 0.0924 0.0378 0.6085 2.7622 0.4613 4.1091 0.0114 1.8357 5.1000 3.0557 22.5197 2.7047 0.1297 29.8425 2.7389 28.7434 3.5352 15.0978 1.9007 11.6032 0.1849 64.6074 4.6809 28.3344 40.8976 1.8416 2.8276 6.8977 19.3100 42.6037 0.8634 21.0097 19.6103 16.1815 11.2211 22.5993 20.9104 19.2938 0.1651 13.1777 9.6713 13.1463 22.0081 31.1309 9.9576 27.1782 29.8972 11.4450 0.0609 1.9590 10.2201 83.1036 20.0482 34.7301 5.6844 1.2426
temp: 298.150 k
press: 1.00000 atm
elementType: 17 17 17 6 6 6 6 6 6 6 6 6 6 1 1 1 1 1 1 1 1 1 1 1
symmnumber: 1
zpe: 473180.8 jmol-1
zpe.correction: 0.180225 hartree
zpe.thermalcorrener: 0.193792 hartree
zpe.thermalcorrenthalpy: 0.194736 hartree
zpe.thermalcorrgfe: 0.139657 hartree
zpe.sumelectzpe: -1766.876867 hartree
zpe.sumelectthermal: -1766.863299 hartree
zpe.sumelectthermalent: -1766.862355 hartree
zpe.sumelectthermalfe: -1766.917435 hartree
dipole: 0.9724 -1.3117 0.0028
dipole: 1.6329
quadrupole: -90.2039 -103.6389 -99.5077
quadrupole: -5.1326 -0.0118 0.0145
quadrupole: 7.5796 -5.8554 -1.7242 -5.1326 -0.0118 0.0145
hfenergy: -1767.0570917 hartree
pointgroup: C01 [X(C10H11Cl3)]
dipole: -0.4747388 -0.432815 -0.0018608 debye
dipolederiv: -0.2161748 0.2458481 0.0013058 0.2629412 -0.5971401 -0.0026776 0.0011859 -0.0020123 -0.0343974 -0.3119837 -0.3108612 -0.0005306 -0.3230092 -0.5114883 -0.0011288 -0.0005054 -0.0010108 -0.0328272 -0.2578582 0.2326843 0.0012716 0.2867329 -0.7234515 -0.0028933 0.0016723 -0.0029837 -0.0625242 0.1671726 0.022524 -0.0019989 -0.130624 0.0149937 -0.0007917 -0.0105569 -0.0016733 0.1192707 0.1999299 0.0991782 0.0027789 0.0566982 -0.1554331 0.0008708 0.0040715 0.00105 -0.0714374 -0.0571528 -0.0468752 0.0274503 0.0102053 0.0786391 0.0217339 -0.0575562 0.0254227 -0.0241874 -0.0580264 -0.0450468 -0.0287743 0.0073261 0.0797938 -0.0171266 0.062577 -0.0199021 -0.0264956 0.0315218 -0.3601283 -0.0011673 -0.5405125 0.7220812 0.0034103 -0.0009592 0.0024757 -0.0560199 -0.2082205 0.0200428 -0.0002361 0.1953933 -0.1986415 -0.0007959 0.0012808 -0.0009366 -0.0911148 0.158511 0.0141647 -0.0004018 -0.0493134 -0.466101 -0.0016194 -0.00034 -0.0018825 0.0408344 0.3119614 0.3700493 0.0006558 0.6456987 0.6285716 0.0014971 0.0010043 0.0018392 -0.059598 0.2805157 -0.2835572 -0.0018893 -0.4424041 1.070963 0.005186 -0.002706 0.005159 -0.0900232 -0.184011 -0.007162 0.0005135 -0.0818608 0.0242848 0.0000485 0.0003295 -0.0001558 0.0516955 0.040788 0.0199879 0.0005103 0.0781226 -0.0616459 -0.0035323 0.0015153 -0.0022478 0.0292453 0.0904419 0.0867822 0.0062791 0.0437555 -0.1326209 0.0304094 0.0134559 -0.0340547 0.0658321 -0.2230047 -0.0028122 0.0356079 0.0033362 0.0851826 0.0185368 0.0214221 0.0209737 0.0805946 0.0922678 -0.0388367 -0.0876257 -0.0258513 0.0404619 -0.0848453 -0.0567357 -0.0552038 -0.1067614 0.0927673 -0.0430623 0.0847006 -0.0272657 0.0331238 0.0927968 0.0555441 0.061128 -0.0991051 -0.2244239 -0.0030027 -0.035217 0.0012169 0.0870229 -0.0187165 -0.02296 -0.0209007 0.0785884 0.0885156 0.0877005 -0.0026036 0.0459542 -0.129989 -0.0402717 -0.0108068 0.0250513 0.0658593 0.0587712 -0.0614082 -0.0004151 -0.0749715 0.0100011 -0.0000884 -0.0009542 -0.0002069 0.1436943 0.0204536 -0.0089238 0.0310125 -0.029329 0.0744075 0.0934666 0.0722542 0.0641786 -0.0182785 0.0199304 -0.0091019 -0.0313577 -0.0294078 0.0753491 -0.0927192 -0.0726677 -0.0635505 -0.0186598 0.0873078 0.0218163 0.000131 0.1171681 -0.0483647 -0.0007496 0.0004352 -0.0005563 0.1158152 unknown
polarizability: 169.2485403|-3.0301622|166.5757649|-0.1493202|0.2295327|75.9969469 unknown
InChI: InChI=1S/C10H11Cl3/c1-5(2)7-4-8(11)6(3)9(12)10(7)13/h4-5H,1-3H3
charge 0 multiplicity 1
24 atoms
Cl -0.965107 2.787213 0.01569
Cl 2.225972 2.528389 0.008053
Cl 1.752477 -3.040611 -0.010612
C  -2.559875 0.02793 0.010069
C  -1.029286 -0.020297 0.008441
C  -3.141744 -0.657295 1.275004
C  -3.137614 -0.60055 -1.286314
C  -0.205199 1.132968 0.009502
C  -0.372238 -1.275439 0.001852
C  1.877855 -0.226281 -0.000893
C  1.205172 1.025116 0.005206
C  1.028051 -1.359749 -0.002506
C  3.388248 -0.307002 -0.005022
H  -2.866406 1.088661 0.033125
H  -2.894313 -1.734723 1.303287
H  -4.243246 -0.565725 1.282006
H  -2.750924 -0.193611 2.198184
H  -2.751041 -0.08983 -2.186175
H  -4.239858 -0.518155 -1.288953
H  -2.879682 -1.672999 -1.365856
H  -0.965872 -2.1937 0.000571
H  3.804805 0.203586 -0.891751
H  3.809443 0.198329 0.882495
H  3.728082 -1.352923 -0.009003
