program: Gaussian 09
title: 000092396
version: EM64L-G09RevD.01
frameworkgroup: C1[X(C13H12ClN5)]
method: RPBEPBE
basis: SDD
operation: Freq
keyword: #p
keyword: freq=noraman
keyword: PBEPBE/SDD
title: #p freq=noraman PBEPBE/SDD
converged: NO YES NO NO
title: Mulliken charges:
elementType: Cl N N N N N C C C C C C C C C C C C C H H H H H H H H H H H H
charge: -0.055374 -0.276106 -0.063907 -0.065327 -0.070354 -0.002875 -0.190895 -0.155869 -0.159498 -0.266155 -0.263672 -0.583476 -0.320473 0.419237 -0.333320 -0.356967 -0.213329 -0.183904 -0.123610 0.292064 0.288899 0.273617 0.273152 0.278442 0.262274 0.283581 0.269707 0.244112 0.286305 0.255651 0.258071
chargesum: 0.00000
title: Mulliken charges with hydrogens summed into heavy atoms:
elementType: Cl N N N N N C C C C C C C C C C C C C
charge: -0.055374 -0.276106 -0.063907 -0.065327 -0.070354 -0.002875 0.101169 0.133030 0.114119 0.006996 0.014770 -0.037621 -0.050766 0.419237 -0.089208 -0.070661 0.042323 0.074167 -0.123610
polarizability: 2.82018070e+02 -1.84366988e+01 1.64595228e+02 8.23984456e+00 9.14585110e+00 1.02954674e+02
1716.lowfreq: -6.1776 -0.0025 -0.0017 -0.0007 1.1471 12.3767 34.3495 62.2354 77.2405
frequency: 33.9456 62.2198 77.0593 104.4490 160.3724 182.8274 197.6154 214.9696 271.6133 305.9896 316.7961 348.0193 357.7738 377.8501 412.5366 469.7695 483.9852 489.5977 506.0332 587.9607 620.5108 626.8404 699.0915 704.0174 740.6482 766.8525 799.3174 805.6828 825.8735 828.4127 834.6544 847.0083 859.9588 886.9407 900.2582 914.0270 934.3938 935.0250 942.5789 958.1970 962.1711 970.3100 977.3950 995.5333 1012.3521 1019.6734 1024.7198 1054.4315 1075.9678 1096.5051 1117.3447 1141.2678 1150.5939 1152.8255 1173.6832 1187.3193 1191.6789 1208.6235 1235.1359 1245.0049 1251.1281 1259.1108 1287.2815 1293.0537 1299.3879 1313.2338 1339.6212 1349.8448 1366.7275 1397.6441 1414.9049 1485.3308 1507.9407 1580.6093 1605.5837 3016.6377 3054.2458 3059.5877 3065.8161 3081.7572 3100.7010 3114.9622 3125.4030 3152.4812 3166.4348 3175.1102 3189.9950
redmass: 6.2772 4.9599 5.5799 6.5366 7.1822 7.3936 6.0255 8.9428 7.5733 5.9737 6.2309 7.1351 6.9000 8.7116 3.0182 6.4636 5.4166 3.5179 2.9140 3.4457 5.7407 5.5454 3.9272 5.8538 6.2083 5.4011 4.9701 1.4172 2.4223 3.5859 1.4387 5.7819 2.8747 3.4304 3.3048 3.2884 1.7119 2.4586 2.6257 2.5457 2.8750 1.3444 5.2839 3.4273 1.3563 1.4108 1.6394 4.9370 2.5601 1.1105 1.3592 2.1564 1.9335 2.7107 1.3451 1.1325 1.6033 1.3899 1.3603 1.4626 1.6868 1.5038 1.5462 1.6009 1.3822 1.5583 4.1451 4.2261 5.5237 7.6280 3.5824 2.8053 1.0858 7.9473 6.3086 1.0867 1.0876 1.0620 1.0870 1.0894 1.0888 1.0925 1.1052 1.0881 1.0898 1.0966 1.0962
irintensity: 0.4151 0.6166 0.9926 0.4287 3.2469 9.3747 3.1490 0.9744 1.4823 1.7572 7.3806 3.2661 1.8063 1.1658 0.0652 5.6302 21.9614 4.1746 18.2477 2.0538 1.0904 5.3070 3.9619 18.5479 1.1686 4.0323 10.2958 29.3945 6.3539 10.6040 56.6907 0.4867 1.8203 70.4696 61.4003 3.5025 26.9865 48.4344 21.5192 10.7841 2.0925 0.9169 3.2259 47.2526 4.4988 0.7675 2.9339 68.2022 39.2327 0.8081 18.7763 0.6671 13.4866 4.6740 4.6359 1.2202 8.9598 2.3180 37.0192 4.2878 2.8862 3.1663 20.9805 3.6432 1.3625 5.8189 4.6991 58.2468 48.4843 81.3469 8.6860 280.2610 25.0683 1.1763 30.9231 13.5912 20.9830 8.8327 8.8030 26.0223 16.2334 3.7123 6.6942 12.4394 2.9021 3.9280 0.0362
temp: 298.150 k
press: 1.00000 atm
elementType: 17 7 7 7 7 7 6 6 6 6 6 6 6 6 6 6 6 6 6 1 1 1 1 1 1 1 1 1 1 1 1
symmnumber: 1
zpe: 612719.8 jmol-1
zpe.correction: 0.233373 hartree
zpe.thermalcorrener: 0.247627 hartree
zpe.thermalcorrenthalpy: 0.248571 hartree
zpe.thermalcorrgfe: 0.191293 hartree
zpe.sumelectzpe: -1234.913139 hartree
zpe.sumelectthermal: -1234.898884 hartree
zpe.sumelectthermalent: -1234.897940 hartree
zpe.sumelectthermalfe: -1234.955219 hartree
dipole: -0.2686 -0.2452 -2.7673
dipole: 2.7911
quadrupole: -140.5492 -129.6996 -113.8369
quadrupole: -5.7014 10.9275 6.0817
quadrupole: -12.5207 -1.6710 14.1917 -5.7014 10.9275 6.0817
hfenergy: -1235.1465116 hartree
pointgroup: C01 [X(C13H12Cl1N5)]
dipole: -0.0887733 -0.1033176 -1.0896119 debye
polarizability: 278.8454483|-25.5725177|167.5171742|12.7697966|7.2862238|103.20535 unknown
InChI: InChI=1S/C13H12ClN5/c14-6-1-3-7(4-2-6)19-13-9-5-8(12(13)17-18-19)10-11(9)16-15-10/h1-4,8-13H,5H2
charge 0 multiplicity 1
31 atoms
Cl 6.000975 -1.378079 0.292291
N  0.410394 0.879559 -0.232727
N  -3.662891 -2.160426 0.378434
N  -4.536424 -1.167114 0.365111
N  -1.073363 2.568811 -0.214942
N  0.153195 2.24352 0.050862
C  -1.422361 -0.845008 0.275472
C  -2.943811 0.889442 0.244008
C  -0.79208 0.175153 -0.736574
C  -2.627435 -1.434889 -0.50306
C  -3.673192 -0.24579 -0.5204
C  -2.10225 0.112716 1.299189
C  -1.833196 1.361932 -0.747192
C  1.715268 0.352449 -0.102489
C  1.981324 -0.99275 -0.47457
C  2.772528 1.164448 0.394897
C  3.285231 -1.520275 -0.357277
C  4.071398 0.636182 0.514532
C  4.315341 -0.700356 0.136789
H  -0.721762 -1.589083 0.681495
H  -3.585319 1.70345 0.60865
H  -0.59296 -0.272447 -1.727078
H  -2.374134 -1.989728 -1.420128
H  -4.180177 0.062221 -1.447572
H  -1.381086 0.755729 1.827509
H  -2.713735 -0.412184 2.04765
H  -2.235156 1.632444 -1.738067
H  1.184758 -1.635584 -0.860612
H  2.566915 2.19937 0.676875
H  3.489133 -2.555012 -0.646896
H  4.884772 1.259494 0.896722
