program: Gaussian 09
title: 000092408
version: EM64L-G09RevD.01
frameworkgroup: C1[X(C12H2Cl8O)]
method: RPBEPBE
basis: SDD
operation: Freq
keyword: #p
keyword: freq=noraman
keyword: PBEPBE/SDD
title: #p freq=noraman PBEPBE/SDD
converged: YES YES NO NO
title: Mulliken charges:
elementType: Cl Cl Cl Cl Cl Cl Cl Cl O C C C C C C C C C C C C H H
charge: 0.075236 0.075254 0.071968 0.071980 0.077892 0.011870 0.007827 0.010029 -0.256456 0.645148 0.553083 -0.315076 -0.314813 -0.085389 -0.085526 -0.128922 -0.349460 -0.255741 -0.093650 -0.174837 -0.114832 0.287897 0.286518
chargesum: 0.00000
title: Mulliken charges with hydrogens summed into heavy atoms:
elementType: Cl Cl Cl Cl Cl Cl Cl Cl O C C C C C C C C C C C C
charge: 0.075236 0.075254 0.071968 0.071980 0.077892 0.011870 0.007827 0.010029 -0.256456 0.645148 0.553083 -0.315076 -0.314813 -0.085389 -0.085526 -0.128922 -0.349460 0.032156 -0.093650 0.111681 -0.114832
polarizability: 2.82796882e+02 -1.89833274e-01 1.88106667e+02 -1.84016770e+01 9.13362383e-02 1.82700874e+02
1716.lowfreq: -0.0024 -0.0024 0.0014 2.7506 5.9069 6.3090 11.9912 16.4321 27.6026
frequency: 11.9687 16.4256 27.6025 62.3943 66.5651 67.7402 88.0390 125.0880 128.1119 167.5726 181.1172 196.2644 200.3176 202.6197 209.8974 214.0418 226.1275 285.0968 308.5536 312.0397 316.9275 320.7398 331.3153 353.3508 356.5467 408.3394 433.4802 439.8441 501.1764 560.1984 593.1627 601.9882 612.5229 619.9843 658.6683 661.2429 681.1665 697.5676 739.5985 779.3478 825.4701 846.4949 859.9094 865.6100 941.5943 1036.3195 1072.6913 1115.4390 1204.4588 1233.5090 1244.4525 1323.0755 1330.2001 1335.1354 1351.1453 1374.8817 1446.6694 1527.6988 1537.7175 1570.2566 1587.2192 3170.3837 3181.3904
redmass: 26.3425 19.1109 25.6272 30.7458 34.0209 27.7717 31.1959 27.6851 11.3960 14.5833 29.4708 29.3280 21.9599 27.3405 6.4730 27.6979 19.1626 16.9761 20.8388 23.5743 12.5253 19.9092 23.1298 13.1151 30.7646 15.5283 10.3126 3.0743 10.5056 9.0771 12.0917 11.4063 13.0593 10.7902 12.3855 8.2554 3.5907 9.5058 12.1711 11.7292 12.1202 1.5350 11.4713 1.3875 11.0535 6.6788 10.6476 1.8189 6.7668 1.4027 4.7801 12.0393 9.4801 12.0181 11.6537 10.8347 3.1195 12.0017 11.8680 8.9513 8.9895 1.0919 1.0932
irintensity: 0.0010 0.0097 0.0013 0.0008 0.0000 0.0019 0.0019 0.0753 0.1668 0.2641 0.0957 0.1111 0.0896 0.0438 0.0002 0.0000 0.3914 0.2823 0.0564 0.0239 0.0209 0.0572 0.0856 0.8428 0.4698 9.9779 0.2237 9.4061 8.8109 3.5878 0.0308 0.5198 7.6042 20.5095 69.1160 23.8092 0.1280 25.1038 57.0522 5.7786 0.7354 0.5679 2.3307 33.6836 32.5023 173.0877 19.5639 79.1424 66.2122 3.1720 28.3813 105.3994 28.6327 56.0394 420.4167 62.2477 305.0918 1.2431 3.8576 3.0158 24.6490 0.4119 1.4001
temp: 298.150 k
press: 1.00000 atm
elementType: 17 17 17 17 17 17 17 17 8 6 6 6 6 6 6 6 6 6 6 6 6 1 1
symmnumber: 1
zpe: 273624.7 jmol-1
zpe.correction: 0.104218 hartree
zpe.thermalcorrener: 0.124994 hartree
zpe.thermalcorrenthalpy: 0.125938 hartree
zpe.thermalcorrgfe: 0.049919 hartree
zpe.sumelectzpe: -4212.653261 hartree
zpe.sumelectthermal: -4212.632486 hartree
zpe.sumelectthermalent: -4212.631541 hartree
zpe.sumelectthermalfe: -4212.707560 hartree
dipole: 0.7618 -0.0012 -0.0289
dipole: 0.7623
quadrupole: -174.3623 -174.7765 -179.0184
quadrupole: -0.0614 -5.1189 -0.0498
quadrupole: 1.6901 1.2759 -2.9660 -0.0614 -5.1189 -0.0498
hfenergy: -4212.7574794 hartree
pointgroup: C01[X(C12H2Cl8O1)]
dipole: -0.2999123 0.0013254 -0.0003481 debye
dipolederiv: -0.1691411 -0.0810494 -0.261503 -0.0750776 -0.0114208 -0.1154831 -0.2578838 -0.1203443 -0.4434545 -0.1700266 -0.0652292 0.2661947 -0.05935 0.001211 0.0884075 0.2622933 0.093426 -0.4554538 -0.1766831 -0.0466505 -0.2584393 -0.082981 0.0024493 -0.1156746 -0.3156371 -0.089716 -0.4829784 -0.1776103 -0.0308268 0.2614745 -0.0634684 0.0132434 0.0849964 0.3206025 0.0592444 -0.4929652 -0.6352008 -0.1900132 0.005409 -0.2480137 -0.0473445 0.0013952 0.0071018 0.0014488 0.0042752 -0.0760733 -0.0374632 0.0010689 -0.0018922 -0.7221684 0.0207042 0.0000439 0.020553 -0.0124557 -0.0678448 -0.0531135 0.0015121 0.0943746 -0.7048979 0.0199516 -0.0027631 0.0198461 -0.0167736 -0.6618591 0.2767421 -0.0083304 0.2963789 -0.1935986 0.0052731 -0.0089063 0.0053034 -0.0170015 -2.2578319 0.2269821 -0.0067651 0.1349367 -0.3116381 0.0025259 -0.0030447 0.0024051 -0.2279857 1.3397852 -0.0147989 0.0006757 0.5681606 0.0827933 -0.0051122 -0.0166813 -0.0051038 -0.0798061 1.6673096 -0.33612 0.0099851 -0.8606956 0.0487764 0.0025389 0.024211 0.0027203 0.1421553 0.0540864 0.1452354 0.4413691 0.0659715 0.0075011 0.1786314 0.5145225 0.2270546 0.5341188 0.0553652 0.1185134 -0.4495718 0.0345575 -0.01513 -0.1453316 -0.5180182 -0.1939729 0.5553939 0.0248368 0.007941 0.4808557 0.0352784 -0.0055632 0.2034332 0.5806155 0.1896834 0.6381064 0.026399 -0.0214256 -0.4818022 -0.0002675 -0.0272229 -0.1621938 -0.5827706 -0.1485731 0.6583624 0.8779888 0.2988154 -0.0082371 0.3428279 0.0793092 -0.0106023 -0.0095654 -0.0106838 -0.2720816 -0.1854651 0.1376613 -0.0040046 0.0916313 1.1179947 -0.0357656 -0.0025509 -0.0355307 -0.1086985 -0.3147359 -0.0345064 0.0010746 0.2915195 -0.2945433 0.0061319 -0.0082506 0.0060586 -0.0853893 0.017254 0.1552305 -0.0045784 -0.0204768 1.0498417 -0.031335 0.0005027 -0.0312039 -0.0363754 -0.1601022 0.0211796 -0.0006879 0.0678135 -0.2211848 0.0058107 -0.0020966 0.005714 -0.0236439 0.8960799 -0.4161453 0.012602 -0.4896402 0.0072699 -0.0026748 0.0147718 -0.0026922 -0.0727503 0.0462422 -0.0346434 0.0009639 -0.0983013 0.0715236 0.0017961 0.0029194 0.0017497 0.1342796 0.0472271 -0.0263155 0.0007344 -0.0232861 0.0727989 0.002577 0.0005843 0.0026132 0.1611218 unknown
polarizability: 284.1767191|14.0870946|181.339103|-0.4419056|0.3560218|188.088601 unknown
InChI: InChI=1S/C12H2Cl8O/c13-3-1-5(15)6(2-4(3)14)21-12-10(19)8(17)7(16)9(18)11(12)20/h1-2H
charge 0 multiplicity 1
23 atoms
Cl -0.727895 0.899865 2.729815
Cl -0.724697 0.733152 -2.777525
Cl -3.752825 -0.425019 -2.774068
Cl -3.756866 -0.254358 2.793117
Cl -5.259229 -0.910351 0.025752
Cl 2.734778 3.083978 -0.089265
Cl 2.659456 -3.334939 0.096918
Cl 5.520135 -1.698178 0.051167
O  0.316463 1.359025 -0.039382
C  -0.936605 0.729402 -0.021311
C  1.494176 0.580104 -0.016902
C  -1.599587 0.514045 1.209811
C  -1.598134 0.439952 -1.23795
C  -2.918801 -0.062081 -1.226791
C  -2.920439 0.012658 1.22768
C  -3.58033 -0.275481 0.007646
C  2.722591 1.280961 -0.036989
C  1.489932 -0.828911 0.023935
C  2.711499 -1.530318 0.044839
C  3.939372 0.578898 -0.016159
C  3.936186 -0.831609 0.02509
H  0.547771 -1.383442 0.039365
H  4.886651 1.123648 -0.031793
