program: Gaussian 09
title: 000092406
version: EM64L-G09RevD.01
frameworkgroup: C1[X(C15H18ClN3O)]
method: RPBEPBE
basis: SDD
operation: Freq
keyword: #p
keyword: freq=noraman
keyword: PBEPBE/SDD
title: #p freq=noraman PBEPBE/SDD
converged: YES YES NO NO
title: Mulliken charges:
elementType: Cl O N N N C C C C C C C C C C C C C C C H H H H H H H H H H H H H H H H H H
charge: -0.047770 -0.449200 -0.210022 -0.084666 -0.093879 0.298968 -0.254238 -0.734612 -0.729384 -0.733159 0.498052 -0.483179 0.408120 -0.199787 -0.374063 -0.382976 -0.283607 -0.226971 -0.219444 -0.113108 0.234410 0.213365 0.203602 0.253234 0.218792 0.217490 0.211059 0.230728 0.212107 0.216941 0.238516 0.363479 0.283532 0.283774 0.240684 0.272927 0.261523 0.258764
chargesum: 0.00000
title: Mulliken charges with hydrogens summed into heavy atoms:
elementType: Cl O N N N C C C C C C C C C C C C C C C
charge: -0.047770 -0.085721 -0.210022 -0.084666 -0.093879 0.298968 -0.019828 -0.064410 -0.082044 -0.073384 0.498052 -0.244663 0.408120 0.083745 -0.090289 -0.142292 -0.010680 0.034552 0.039320 -0.113108
polarizability: 3.10376170e+02 1.63511945e+01 1.58164555e+02 1.13915431e+01 -2.46641466e+01 1.46591025e+02
1716.lowfreq: -8.0217 -4.2448 -0.0028 -0.0025 -0.0021 4.9857 21.1119 33.3841 42.8388
frequency: 20.3286 33.1296 42.8174 61.0203 72.8355 95.6732 103.9800 150.3262 156.1241 200.0663 204.4484 231.5900 239.5227 251.7980 255.5586 276.7858 287.8416 302.1414 310.6437 342.3553 377.9100 392.8746 406.9753 415.8765 425.6914 498.0752 512.0131 585.3792 619.0850 625.9386 640.9570 655.0664 664.6577 676.8346 698.1960 719.2108 786.2251 809.6892 820.3198 827.2006 836.7853 852.1968 877.6105 900.7876 915.0692 930.0497 933.2190 944.4974 957.0889 961.9178 974.0012 976.6696 998.8326 1009.0780 1029.8809 1047.4426 1074.7111 1111.4133 1122.8123 1153.9081 1189.3714 1191.0846 1201.4621 1220.9511 1230.9200 1235.6213 1248.8975 1286.4563 1297.7041 1311.5719 1330.2945 1346.0347 1368.5238 1373.9298 1379.0399 1384.9053 1399.1816 1405.8596 1421.8748 1435.4005 1458.1932 1461.7547 1470.5323 1478.3062 1481.6483 1485.8892 1496.9870 1571.9040 1597.3239 1650.2324 2966.5890 2973.4389 2982.9128 3058.9032 3061.1322 3066.0858 3068.6434 3072.8438 3085.8137 3087.3401 3092.2230 3133.9216 3147.9117 3171.0903 3174.2900 3250.9471 3259.7301 3286.5830
redmass: 3.7261 4.5643 5.2101 4.6336 5.0973 4.5327 5.6522 6.2638 5.3193 1.4434 2.2876 6.5644 1.7746 1.1946 2.9182 2.5695 2.6651 4.0562 3.3037 2.8915 2.3886 3.7401 2.7205 3.3152 6.6922 3.4639 2.9087 3.6942 5.8895 6.4309 2.9075 2.3810 4.4685 1.7174 3.9909 3.6580 3.1602 1.6209 2.1948 1.8370 1.2713 1.4013 1.9503 2.3371 5.2611 1.6285 1.6089 1.2404 1.3610 6.5201 1.3552 4.5954 4.0177 1.7514 1.4839 2.4786 2.7054 1.4306 2.4783 4.8904 1.3622 1.3393 1.9693 2.3708 2.6114 2.5743 2.8487 1.4584 1.3518 3.2544 2.2110 1.7155 3.5426 1.2029 1.2084 3.0569 2.7001 1.2265 3.2378 1.1889 1.0499 1.0504 1.0498 2.2581 1.0945 1.0561 1.0582 7.3486 6.1152 8.4050 1.0355 1.0360 1.0362 1.0988 1.0918 1.0986 1.0931 1.0977 1.0880 1.0997 1.0991 1.0899 1.0897 1.0958 1.0966 1.0974 1.1013 1.0679
irintensity: 0.1677 0.1181 0.5496 0.1870 0.1618 1.3988 0.5429 1.8310 0.7389 0.2368 1.0751 2.3183 0.9758 0.8908 0.1397 0.4229 2.4343 1.5567 3.9573 1.7316 0.6077 2.5524 0.4500 2.7926 15.5312 3.7837 24.4380 0.7697 5.6869 0.9212 41.8979 4.9779 4.6854 117.2218 12.7257 15.0089 1.3366 18.0171 38.2812 27.1041 13.6524 11.5927 16.1805 54.1406 20.1227 4.9493 2.1895 0.8519 2.7179 41.1383 3.9876 77.8501 39.1567 1.1749 5.2396 9.8792 53.2637 4.3570 30.3852 2.1813 3.0890 9.1612 16.8721 2.1943 1.7282 18.6827 50.1250 35.1378 0.3840 1.4363 11.7837 0.4454 17.8917 22.9690 16.6468 17.7161 10.5356 15.1287 51.7425 87.5285 0.9530 2.5469 7.3762 72.6149 1.9672 13.9556 29.0687 1.0602 26.3727 6.5411 24.3069 32.1815 26.0937 9.8488 2.4319 8.2147 63.3109 94.8915 14.9791 17.5907 25.6536 7.7861 2.4002 3.6210 1.4621 2.1869 1.5039 256.1244
temp: 298.150 k
press: 1.00000 atm
elementType: 17 8 7 7 7 6 6 6 6 6 6 6 6 6 6 6 6 6 6 6 1 1 1 1 1 1 1 1 1 1 1 1 1 1 1 1 1 1
symmnumber: 1
zpe: 794065.5 jmol-1
zpe.correction: 0.302444 hartree
zpe.thermalcorrener: 0.321995 hartree
zpe.thermalcorrenthalpy: 0.322939 hartree
zpe.thermalcorrgfe: 0.253187 hartree
zpe.sumelectzpe: -1280.417472 hartree
zpe.sumelectthermal: -1280.397920 hartree
zpe.sumelectthermalent: -1280.396976 hartree
zpe.sumelectthermalfe: -1280.466728 hartree
dipole: 0.3112 -0.7701 2.0601
dipole: 2.2212
quadrupole: -140.2608 -128.6618 -126.2795
quadrupole: -6.2076 2.8390 -0.4038
quadrupole: -8.5268 3.0722 5.4546 -6.2076 2.8390 -0.4038
hfenergy: -1280.7199154 hartree
pointgroup: C01 [X(C15H18Cl1N3O1)]
dipole: 0.1039219 0.1333019 -0.8573969 debye
polarizability: 310.7491687|-15.3924213|147.1092942|-10.1157599|-24.7954872|157.2732868 unknown
InChI: InChI=1S/C15H18ClN3O/c1-15(2,3)14(20)13(19-10-17-9-18-19)8-11-4-6-12(16)7-5-11/h4-10,14,20H,1-3H3
charge 0 multiplicity 1
38 atoms
Cl 6.266067 -0.066774 0.002312
O  -1.36686 -0.932225 2.065537
N  -2.11598 0.997197 -0.099562
N  -3.072292 0.907089 0.931397
N  -3.925258 2.090741 -0.863699
C  -1.405093 -2.146101 -0.16302
C  -0.79399 -0.980009 0.711847
C  -1.030882 -3.464544 0.568984
C  -0.744953 -2.129566 -1.566619
C  -2.94714 -2.075141 -0.299874
C  -0.808931 0.407551 0.075602
C  0.266995 1.135357 -0.349477
C  1.703785 0.793913 -0.246385
C  -2.659108 1.708223 -1.153546
C  2.276626 0.232223 0.931045
C  2.570459 1.119924 -1.326961
C  -4.131365 1.581545 0.413267
C  3.660432 -0.030455 1.011656
C  3.954189 0.854365 -1.2650
C  4.479015 0.274274 -0.093668
H  0.262423 -1.254932 0.857907
H  -1.477716 -4.333189 0.051171
H  0.065956 -3.611026 0.594549
H  -1.398082 -3.443281 1.609697
H  -1.047868 -3.02692 -2.137078
H  0.359589 -2.132588 -1.493525
H  -1.045985 -1.241371 -2.15332
H  -3.432514 -2.018251 0.690515
H  -3.312078 -2.990456 -0.802062
H  -3.282766 -1.214419 -0.904903
H  0.059599 2.107842 -0.821101
H  -2.187878 -0.353173 2.018386
H  -2.13761 1.894392 -2.087793
H  1.648862 0.042724 1.80786
H  2.15683 1.575348 -2.234325
H  -5.057977 1.705336 0.966232
H  4.093859 -0.450631 1.923724
H  4.609937 1.097008 -2.105871
