program: Gaussian 09
title: 000092669
version: EM64L-G09RevD.01
frameworkgroup: C1[X(C22H20BrN5O7)]
method: RPBEPBE
basis: SDD
operation: Freq
keyword: #p
keyword: freq=noraman
keyword: PBEPBE/SDD
title: #p freq=noraman PBEPBE/SDD
converged: YES YES NO NO
title: Mulliken charges:
elementType: Br O O O O O O O N N N N N C C C C C C C C C C C C C C C C C C C C C C H H H H H H H H H H H H H H H H H H H H
charge: 0.063390 -0.301584 -0.273265 -0.209232 -0.185734 -0.205798 -0.212252 -0.239316 -0.397007 -0.038543 -0.092429 0.015652 0.012650 0.246565 0.295140 0.280908 -0.369400 -0.073152 -0.386553 -0.372685 -0.293631 -0.276389 -0.370033 -0.261343 -0.248363 -0.244741 -0.269574 0.277813 0.304999 -0.300340 -0.536062 0.455038 -0.373177 0.302820 -0.754960 0.223877 0.244919 0.355241 0.237728 0.224592 0.274984 0.208940 0.212804 0.288322 0.227975 0.237055 0.208894 0.203235 0.234922 0.249861 0.336778 0.309072 0.256170 0.252618 0.242600
chargesum: 0.00000
title: Mulliken charges with hydrogens summed into heavy atoms:
elementType: Br O O O O O O O N N N N N C C C C C C C C C C C C C C C C C C C C C C
charge: 0.063390 -0.301584 -0.273265 -0.209232 -0.185734 -0.205798 -0.212252 -0.239316 -0.041766 -0.038543 -0.092429 0.015652 0.012650 0.246565 0.295140 0.280908 0.099397 -0.073152 -0.148825 -0.148093 -0.018647 0.145355 -0.081711 -0.033368 -0.011308 0.167388 0.215209 0.277813 0.304999 -0.300340 -0.199284 0.455038 -0.064105 0.302820 -0.003572
polarizability: 8.39528174e+02 -7.48954245e+00 3.52634002e+02 5.23645581e+00 -5.10547541e+00 1.99100925e+02
1716.lowfreq: -6.1289 -0.9817 -0.0011 -0.0005 0.0004 2.1472 8.3668 11.0067 17.6144
frequency: 8.2436 10.9008 17.5950 20.2730 27.8263 33.0833 36.3738 48.5803 52.3011 59.0683 62.9382 73.4988 90.1781 104.0814 116.7881 120.7390 126.5235 132.2599 138.9407 152.6305 156.3327 175.2312 186.1275 191.6939 207.5781 212.4686 216.3925 262.9808 269.0476 274.2309 292.0808 300.0910 326.9372 339.3139 352.1836 374.8006 383.6767 404.3001 418.5801 427.9523 454.3184 471.7487 478.6866 483.0898 484.8836 517.7047 518.9807 536.1224 567.2063 582.6045 592.4364 606.7684 611.3132 641.7742 659.2021 665.8162 668.9792 676.3962 682.3144 700.4630 728.6508 745.8428 763.8116 769.6985 773.3313 776.1563 791.4044 797.0888 804.6025 819.5701 834.2536 881.8851 888.7684 896.1678 907.9848 930.7704 946.7131 958.9533 961.7439 976.6194 989.9972 1006.6016 1011.4711 1018.7619 1034.2458 1038.3878 1047.3625 1051.9675 1057.3634 1066.8837 1099.5773 1116.0328 1118.6530 1138.6614 1155.8899 1164.8711 1176.0092 1180.9360 1189.9975 1191.2801 1193.3664 1202.6036 1214.3281 1215.6716 1238.2552 1252.5828 1258.8313 1296.5300 1320.3195 1333.2875 1339.4359 1345.9977 1354.9731 1361.4191 1363.4308 1365.6610 1385.9016 1395.4031 1403.1397 1407.7188 1414.2966 1425.1672 1437.9300 1448.9098 1454.9025 1456.5013 1460.1625 1461.6238 1464.8724 1473.4191 1481.4112 1506.8131 1546.3382 1549.8565 1553.0975 1584.0548 1600.5932 1624.6933 1657.1259 2946.5536 2952.7949 2967.6604 3003.0881 3003.7617 3014.9130 3025.7347 3046.0495 3090.6470 3097.9779 3121.4472 3137.7447 3139.5742 3152.8199 3158.0225 3172.1887 3176.0187 3184.9959 3194.4359 3491.5454
redmass: 8.8939 8.5256 11.4996 6.8733 5.0189 7.5976 6.2533 9.1725 10.4886 15.3144 5.2552 4.2971 4.6479 7.1975 5.6404 4.3172 2.7829 1.4280 10.1180 7.5800 4.2676 4.7831 4.9588 5.2937 3.3141 5.0630 3.3038 9.4252 8.0132 3.6733 2.4989 9.7719 4.5274 12.1763 7.9961 7.7466 6.3608 3.0334 3.7880 4.8129 5.5076 5.9217 6.9987 3.2012 3.7316 3.9548 6.6537 4.6166 3.1572 5.2496 2.3926 5.0775 4.6643 5.5208 7.8424 5.0731 5.7813 1.5278 10.0710 6.2452 5.3384 6.3417 5.2576 1.4046 7.5167 2.5997 2.8190 3.6557 4.5400 6.4273 1.5441 1.5834 6.9953 2.5173 4.6312 1.4183 2.7020 1.4301 1.3773 1.3809 1.7561 1.3510 3.7063 2.9125 2.9384 3.0437 1.6817 2.2121 2.1324 2.3762 2.6075 2.1728 4.6494 2.2127 1.8608 2.1568 3.3705 1.2398 1.4232 3.9528 3.2068 1.1636 1.3125 3.8759 1.1931 1.1471 1.7790 2.3071 1.8446 4.0655 1.2627 8.0248 1.8635 1.6300 6.2223 2.3157 1.2459 4.8561 1.7579 1.7837 7.3480 5.8798 3.4750 3.0168 1.0804 1.0933 1.0782 1.0995 1.7655 1.2838 1.1117 3.3004 6.1907 4.2413 5.4556 7.9311 6.8670 6.0824 9.8830 1.0570 1.0568 1.0653 1.0391 1.0995 1.1039 1.0636 1.0984 1.1070 1.0942 1.0869 1.1011 1.0906 1.0872 1.0953 1.0957 1.0975 1.0926 1.0925 1.0758
irintensity: 1.3451 0.2856 0.1545 0.4871 0.2416 0.7036 1.4310 0.0527 0.8697 0.1054 0.1579 3.7723 1.0313 1.8508 2.4677 12.4582 8.0797 1.9696 3.7325 6.1850 5.5857 5.3336 7.8051 1.7992 3.4209 7.5297 6.4592 3.2349 10.2793 2.5503 9.9310 0.6845 9.1243 2.6948 1.9603 14.6825 0.1495 1.6699 14.4866 4.3115 22.3081 9.2056 49.7135 7.5656 2.7075 3.2756 8.0566 26.2449 3.9040 23.6092 16.0402 50.3431 19.3991 1.3714 1.1484 17.9487 56.0117 67.7843 53.7252 15.6514 34.4814 34.4193 14.7081 93.4447 51.2315 34.3660 26.1930 9.8016 9.2163 244.7839 28.1047 0.8257 43.6325 8.0206 31.0572 19.6841 46.5469 22.1745 1.5991 1.6873 14.1983 0.8314 17.3062 34.0904 90.6890 100.3346 6.5074 15.8550 29.8877 178.1535 62.6783 64.8521 5.5608 34.3630 67.0412 35.8742 242.6272 68.5355 527.4354 712.3235 316.3034 28.4853 109.4121 501.0537 43.1055 28.5946 18.7675 80.9158 91.1808 128.5000 90.7234 116.3169 159.2044 39.3135 117.9440 99.4431 42.6586 52.7279 7.0061 82.6411 2.5468 782.9968 96.6020 279.8877 3.7088 29.4082 15.2699 37.7979 89.4244 3.9295 6.2103 161.2720 125.7916 157.6464 65.4135 321.4871 532.9217 17.0711 254.1651 22.2957 126.5366 40.5554 5.4872 32.2930 78.3714 39.2334 22.3442 18.8084 8.0575 1.5755 20.9743 8.8322 6.5622 32.5336 18.7322 11.5316 8.5407 28.1139 475.2098
temp: 298.150 k
press: 1.00000 atm
elementType: 35 8 8 8 8 8 8 8 7 7 7 7 7 6 6 6 6 6 6 6 6 6 6 6 6 6 6 6 6 6 6 6 6 6 6 1 1 1 1 1 1 1 1 1 1 1 1 1 1 1 1 1 1 1 1
symmnumber: 1
zpe: 1044000.2 jmol-1
zpe.correction: 0.397639 hartree
zpe.thermalcorrener: 0.431015 hartree
zpe.thermalcorrenthalpy: 0.431959 hartree
zpe.thermalcorrgfe: 0.325181 hartree
zpe.sumelectzpe: -1661.391701 hartree
zpe.sumelectthermal: -1661.358325 hartree
zpe.sumelectthermalent: -1661.357381 hartree
zpe.sumelectthermalfe: -1661.464159 hartree
dipole: -15.7005 1.6917 -1.1368
dipole: 15.8323
quadrupole: -258.8366 -204.7700 -212.2105
quadrupole: -40.7287 -6.0008 -21.0991
quadrupole: -33.5642 20.5024 13.0619 -40.7287 -6.0008 -21.0991
hfenergy: -1661.7893399 hartree
pointgroup: C01 [X(C22H20Br1N5O7)]
dipole: 6.160477 -0.7369548 0.5518169 debye
polarizability: 838.6857004|-7.629758|242.1150365|20.8233236|-69.4071656|310.462364 unknown
InChI: InChI=1S/C22H20BrN5O7/c1-14(29)35-11-10-34-9-8-24-19-6-7-20(17-5-3-2-4-16(17)19)25-26-22-18(23)12-15(27(30)31)13-21(22)28(32)33/h2-7,12-13,24H,8-11H2,1H3
charge 0 multiplicity 1
55 atoms
Br -3.162783 0.139006 -2.856139
O  6.188439 -1.900316 0.953009
O  7.255264 0.450738 -0.382233
O  -5.56463 -0.474572 3.268176
O  -3.452402 0.227019 2.753871
O  -9.053721 -0.163766 -0.072232
O  -8.499555 -0.023624 -2.287193
O  8.795995 0.97225 -2.051574
N  3.600141 -1.229618 1.002906
N  -1.67125 0.485784 -0.068831
N  -2.668424 -0.23788 0.358633
N  -4.656588 -0.111413 2.418299
N  -8.189492 -0.084258 -1.031115
C  2.079771 0.41117 -0.007211
C  2.315195 -0.824184 0.739963
C  0.722947 0.82601 -0.268923
C  3.988353 -2.441428 1.732598
C  -0.383056 0.014225 0.213878
C  1.19946 -1.584725 1.198994
C  3.154729 1.229631 -0.482373
C  -0.113172 -1.172652 0.940958
C  5.45396 -2.28878 2.164052
C  0.491781 2.029728 -1.005669
C  2.90189 2.406962 -1.194767
C  1.560024 2.808423 -1.459682
C  7.530306 -1.363227 1.204139
C  8.044847 -0.781678 -0.099224
C  -3.982099 -0.022398 -0.012784
C  -5.018611 -0.090383 0.989516
C  -4.440549 0.045669 -1.378858
C  -6.38594 -0.126358 0.676765
C  -6.760905 -0.06473 -0.674818
C  -5.796795 0.026287 -1.710237
C  7.751753 1.254306 -1.425873
C  6.844371 2.43845 -1.671001
H  3.361654 -2.575528 2.633304
H  3.8714 -3.342855 1.096262
H  4.394342 -0.775398 0.540585
H  1.365126 -2.510621 1.756349
H  4.198822 0.956165 -0.289874
H  -0.96152 -1.756896 1.311166
H  5.548692 -1.493229 2.934005
H  5.8408 -3.2426 2.576824
H  -0.544341 2.320127 -1.198677
H  3.7342 3.026116 -1.54615
H  1.367435 3.730624 -2.018147
H  7.492959 -0.579247 1.989852
H  8.210604 -2.174949 1.539834
H  9.115175 -0.518122 -0.027345
H  7.909825 -1.491426 -0.934182
H  -7.134343 -0.188485 1.470069
H  -6.137074 0.084359 -2.747039
H  7.427394 3.264226 -2.105788
H  6.061065 2.151936 -2.397112
H  6.35333 2.763637 -0.740356
