program: Gaussian 09
title: 000092388
version: EM64L-G09RevD.01
frameworkgroup: C1[X(C8H7NO5)]
method: RPBEPBE
basis: SDD
operation: Freq
keyword: #pfreq=noraman
keyword: PBEPBE/SDD
title: #p freq=noraman PBEPBE/SDD
converged: YES YES NO NO
title: Mulliken charges:
elementType: O O O O O N C C C C C C C C H H H H H H H
charge: -0.239947 -0.293411 -0.206570 -0.164343 -0.224131 0.030831 0.348995 -0.275152 0.170730 -0.338197 -0.261329 -0.139413 0.206142 -0.495857 0.291450 0.320816 0.266172 0.271379 0.235266 0.251412 0.245158
chargesum: 0.00000
title: Mulliken charges with hydrogens summed into heavy atoms:
elementType: O O O O O N C C C C C C C C
charge: -0.239947 -0.293411 -0.206570 -0.164343 -0.224131 0.030831 0.348995 0.016297 0.170730 -0.017382 0.004843 0.131966 0.206142 0.235979
polarizability: 2.16943344e+02 1.76373916e+01 1.21160891e+02 3.87231695e+00 -1.92952943e+00 5.67764683e+01
1716.lowfreq: 0.0004 0.0007 0.0010 4.1401 7.9908 8.7674 34.0577 62.3230 64.5288
frequency: 34.0388 62.3219 64.5275 91.4623 100.9349 125.6929 153.4305 184.2288 226.3231 258.7960 287.6069 320.0188 372.3258 381.6788 475.4097 582.4784 601.7675 628.5780 664.3578 711.8976 736.0663 755.6029 764.8361 813.7720 850.2147 869.6950 878.3901 904.7202 916.2372 943.8263 1018.9391 1035.3550 1073.1584 1114.5828 1130.7709 1140.4860 1147.2036 1207.8979 1221.4167 1244.3113 1327.2803 1364.6607 1383.1851 1423.4441 1451.5652 1454.3386 1464.0057 1532.9565 1626.9308 1642.8173 3007.4043 3111.1546 3137.2853 3153.2190 3230.8224 3259.5450 3268.9167
redmass: 8.0613 5.4198 5.2559 2.4373 1.5341 4.7489 4.6782 7.8446 5.8261 7.5433 4.9481 9.6898 5.3704 6.6173 7.7527 3.1225 7.9749 5.2864 6.9330 7.2553 9.0071 7.4082 1.2662 7.7764 1.3231 5.5880 6.5497 5.2740 1.3937 1.3816 2.4491 2.3791 3.2743 1.2622 2.5671 1.7108 1.4652 10.2073 6.5095 1.7651 1.6299 13.1190 2.6629 1.1792 1.0515 4.6793 1.0546 5.4192 10.0669 9.0766 1.0294 1.1048 1.0866 1.1051 1.0918 1.0994 1.1080
irintensity: 0.9089 4.0191 2.0247 0.0829 0.5383 0.7142 1.9988 1.2617 0.7038 9.7517 13.4985 0.3104 3.3292 9.4479 1.0449 9.9638 9.1735 4.4577 6.9029 25.8486 13.1493 7.0508 85.0287 14.1094 16.3730 2.9548 14.4311 15.7730 1.5870 14.1482 21.1506 226.5700 40.9643 0.3060 70.5468 29.0299 48.4243 138.1588 282.6815 2.6088 84.8950 106.8943 4.3808 37.1079 14.0806 137.6583 13.9950 2.6085 29.9051 511.4817 34.2998 22.1866 5.1899 12.2589 1.8003 3.8216 2.6261
temp: 298.150 k
press: 1.00000 atm
elementType: 8 8 8 8 8 7 6 6 6 6 6 6 6 6 1 1 1 1 1 1 1
symmnumber: 1
zpe: 376434.2 jmol-1
zpe.correction: 0.143376 hartree
zpe.thermalcorrener: 0.156506 hartree
zpe.thermalcorrenthalpy: 0.157450 hartree
zpe.thermalcorrgfe: 0.101986 hartree
zpe.sumelectzpe: -738.764701 hartree
zpe.sumelectthermal: -738.751571 hartree
zpe.sumelectthermalent: -738.750627 hartree
zpe.sumelectthermalfe: -738.806091 hartree
dipole: -3.6953 -5.3535 0.0238
dipole: 6.5051
quadrupole: -60.6824 -83.7463 -82.2819
quadrupole: -10.7670 -0.4333 -0.0014
quadrupole: 14.8878 -8.1761 -6.7117 -10.7670 -0.4333 -0.0014
hfenergy: -738.9080771 hartree
pointgroup: C01 [X(C8H7N1O5)]
dipole: -1.2709713 -2.1027612 0.716298 debye
dipolederiv: -0.0586426 0.3467257 -0.1443794 0.3001462 -0.3646814 0.1076807 -0.0721557 0.111675 -0.1912002 -0.9368818 0.2976517 -0.114841 0.7717853 -0.8869711 0.3699295 -0.4167528 0.3677684 -0.5286672 -0.9936091 -0.2116152 0.221654 0.0187618 -0.4892185 0.1945473 0.0650424 0.204916 -0.4603638 -0.4263115 -0.1747763 -0.1490971 -0.4488803 -0.7150925 -0.0762559 -0.1554644 -0.0207218 -0.328383 -0.3585455 0.1650683 -0.330994 -0.0081704 -0.5228992 0.0995396 -0.2184947 0.0544682 -0.4552534 0.4002099 -0.0352404 0.5636691 0.6101432 1.4302789 -0.1068959 0.3749144 -0.1505745 0.6153502 -1.0225546 -0.3323363 0.1082232 0.3190932 0.3130739 -0.1246022 -0.1499107 -0.1446302 0.0659531 1.3353899 0.4672769 -0.1301653 0.4364671 0.1245912 -0.0393644 -0.1342261 0.0737893 0.0079837 -1.1059382 -0.0958362 -0.0172471 -0.5244669 -0.5054243 0.1394554 0.1552149 0.1181789 -0.1134119 0.6222032 0.3145469 -0.1306194 -0.0691007 -0.063535 -0.0211638 0.0150123 -0.0180923 -0.0853696 -0.1563579 -0.1516254 0.0666603 -0.5548956 -0.3818992 0.049123 0.267247 0.0628357 -0.2156226 -0.3269999 -0.3723449 0.1419597 0.1234133 0.3440532 -0.1837036 -0.0694648 -0.2041033 0.0233498 1.9800887 -0.0445832 -0.1618198 -0.7792246 0.9335471 -0.54474 0.25664 -0.6011634 0.6863532 0.6430633 -0.226354 0.1015582 -0.2268848 0.3619143 -0.034001 0.1019775 -0.0195806 0.2786773 0.1656953 -0.0179496 0.0061944 0.0304597 0.0707751 0.0204747 -0.0342907 0.0178613 0.144345 0.1764927 -0.0198249 0.032613 -0.0206322 0.1138965 0.0464527 0.0111585 0.0575497 0.1653414 -0.0125383 0.0264306 -0.0154464 0.0369424 0.1335197 0.0314341 -0.0142446 0.0362597 0.1794088 0.0927755 -0.0184566 0.0087831 -0.0311074 0.0863449 0.0593981 0.0039487 0.063461 0.1833004 0.0643333 -0.0111319 0.0172874 0.0562572 -0.0367728 0.1060758 -0.0230134 0.1097574 0.0488898 -0.0513035 0.0177533 -0.0731805 -0.0770703 -0.0171115 -0.0783501 -0.0365754 -0.0462686 0.0635181 -0.0305686 0.0766215 -0.0008126 0.0369637 0.0716109 -0.0150341 0.0734376 -0.0733858 -0.0841992 unknown
polarizability: 213.0329846|26.5427134|116.7555987|-1.2567587|-21.948097|65.0921207 unknown
InChI: InChI=1S/C8H7NO5/c1-13-8(10)7(9(11)12)5-6-3-2-4-14-6/h2-5H,1H3
charge 0 multiplicity 1
21 atoms
O  -2.105773 -1.714516 0.446423
O  2.545622 -1.176159 0.449777
O  3.287586 0.612672 -0.853842
O  1.384846 2.656767 -0.217513
O  -0.40813 1.990028 -1.462263
N  0.617489 1.745823 -0.707178
C  -1.511576 -0.527221 -0.105275
C  -0.082205 -0.576491 -0.080028
C  0.904153 0.349879 -0.352404
C  -2.551502 0.323284 -0.519035
C  -3.792982 -0.323162 -0.212546
C  -3.482242 -1.550088 0.367786
C  2.355124 -0.001408 -0.292415
C  3.944701 -1.666874 0.496233
H  0.313368 -1.542058 0.260233
H  -2.410521 1.284039 -1.004241
H  -4.791776 0.061911 -0.405843
H  -4.081163 -2.371929 0.751976
H  3.902682 -2.568168 1.123103
H  4.59926 -0.899718 0.941669
H  4.300638 -1.902613 -0.520716
