program: Gaussian 09
title: 000092442
version: EM64L-G09RevD.01
frameworkgroup: C1[X(C24H16ClN3O4)]
method: RPBEPBE
basis: SDD
operation: Freq
keyword: #p
keyword: freq=noraman
keyword: PBEPBE/SDD
title: #p freq=noraman PBEPBE/SDD
converged: YES YES NO NO
title: Mulliken charges:
elementType: Cl O O O O N N N C C C C C C C C C C C C C C C C C C C C C C C C H H H H H H H H H H H H H H H H
charge: -0.048531 -0.208240 -0.224373 -0.224246 -0.267997 -0.317061 -0.210710 -0.015711 0.246159 0.237612 0.300970 0.135475 0.151579 0.153385 -0.026349 -0.012525 -0.445414 0.043067 0.041563 -0.391904 -0.385807 0.350163 -0.395670 -0.347582 0.021027 -0.383035 -0.348045 -0.326541 -0.279656 -0.195120 -0.103953 -0.497774 0.284642 0.285039 0.284018 0.287581 0.241812 0.242753 0.242143 0.243289 0.300133 0.283299 0.191863 0.191532 0.260417 0.201071 0.201161 0.234493
chargesum: 0.00000
title: Mulliken charges with hydrogens summed into heavy atoms:
elementType: Cl O O O O N N N C C C C C C C C C C C C C C C C C C C C C C C C
charge: -0.048531 -0.208240 -0.224373 -0.224246 -0.267997 -0.317061 -0.210710 -0.015711 0.246159 0.237612 0.300970 0.135475 0.151579 0.153385 -0.026349 -0.012525 -0.160772 0.043067 0.041563 -0.106865 -0.101789 0.350163 -0.108089 0.136983 0.021027 0.102397 -0.047912 -0.043242 0.103739 0.065296 -0.103953 0.138951
polarizability: 6.82847456e+02 9.59902690e+00 3.17632069e+02 -3.67644306e+01 1.24106785e+01 1.38083163e+02
1716.lowfreq: -3.9747 -0.0014 -0.0011 -0.0004 2.3226 5.8773 15.7210 17.9249 36.0605
frequency: 15.7039 17.8925 36.0505 47.1257 58.8346 76.6518 79.5252 92.3871 100.4541 103.6512 117.9801 118.9928 150.5642 173.4065 191.5822 201.7004 215.4970 224.4807 251.2794 267.8101 274.8259 296.1230 320.6350 323.1726 357.7555 361.0685 373.7022 391.3705 402.5500 410.7195 422.1058 441.9494 448.3496 463.4052 463.9663 473.3478 489.3928 524.6172 536.7529 587.2890 590.2050 599.1665 611.8281 625.5448 656.5282 685.1019 710.5873 714.5904 716.8714 742.6847 750.6707 759.6904 767.9782 769.1255 793.1476 819.8803 823.1201 828.1299 838.9336 881.4871 882.3223 886.6600 898.7622 900.8105 907.8016 946.6263 962.0347 966.9412 1012.4212 1015.9846 1043.7959 1045.7471 1051.2164 1065.2361 1066.8307 1088.5535 1092.1179 1112.9428 1128.4374 1139.1452 1151.6989 1160.1220 1167.7269 1181.5415 1199.6806 1207.6080 1221.2916 1237.3096 1255.3172 1264.9362 1282.1023 1285.0488 1288.0898 1315.3296 1332.3256 1346.1980 1366.0825 1378.0826 1382.6610 1389.9650 1405.9839 1411.2437 1420.4132 1438.7200 1439.9435 1443.6323 1449.9825 1456.8524 1458.4075 1467.5007 1475.0904 1491.7522 1510.2357 1538.1734 1557.5534 1566.8322 1584.2526 1587.0486 1603.6846 1612.2216 1615.3399 1621.9939 2904.3106 2925.1972 2951.3259 2996.3723 3016.9130 3039.3133 3078.7424 3104.5722 3109.5044 3158.5392 3160.4387 3173.1074 3175.0370 3177.1020 3188.7533 3201.0371
redmass: 6.3016 6.0525 8.5449 2.1667 6.0396 3.3147 7.6750 5.5005 5.5904 8.3002 9.0439 2.2090 4.2314 6.7153 6.6563 7.9040 7.6484 1.2212 7.9884 6.9743 6.9202 6.3206 7.3108 6.8937 4.1137 4.2402 6.3578 5.6007 6.2428 7.5423 8.0341 3.6218 8.0506 4.6392 4.3962 5.5473 5.6299 7.3189 8.4780 4.9908 5.8710 7.7577 5.8263 6.0815 7.8939 8.0875 5.4609 4.9022 9.0471 5.6159 6.9509 4.5476 1.3567 4.8038 6.4458 7.3323 5.8829 1.4682 2.3001 5.9131 1.4802 2.2239 1.4569 4.9082 1.4760 6.1220 1.3277 4.7658 1.3887 1.3846 3.2852 2.1801 4.2189 3.4782 2.4098 4.1800 3.0563 1.2686 2.5632 1.6585 1.7842 1.5118 1.9227 1.6441 2.8719 3.9812 1.9109 1.9794 2.3058 2.0755 1.1687 1.3747 3.2412 2.5085 5.4204 1.5182 1.8730 2.2516 3.9894 1.4976 6.8748 5.7207 4.2956 1.8631 1.7626 3.7152 1.3630 3.1452 1.0511 1.0653 1.0753 1.0825 6.5576 7.6231 11.2417 6.7772 9.7957 8.4603 8.3865 9.1203 9.3561 9.8283 1.0530 1.0354 1.1062 1.1026 1.0590 1.0577 1.1040 1.0970 1.1067 1.0892 1.0893 1.0905 1.0962 1.0965 1.0938 1.0966
irintensity: 0.0301 0.1053 0.5917 5.1183 0.8762 0.1849 0.1009 0.6962 0.5972 0.5681 11.5145 3.3757 2.7839 1.3686 0.4410 2.2485 3.0503 4.2839 3.1790 2.5817 1.4511 3.4561 0.9725 1.7788 26.7728 1.8688 29.2614 0.0104 5.7801 22.3150 3.1601 6.9681 10.3446 0.1404 1.5127 2.9451 12.5067 6.3100 0.3082 13.4591 4.7516 0.1518 9.8856 2.5377 2.1621 20.2780 0.3944 10.9553 2.2800 8.5976 0.2078 2.3703 18.6793 36.7868 2.5343 1.5680 1.4438 56.1771 16.2582 22.6361 19.7677 41.5906 22.5712 44.4354 29.1924 3.2810 2.7945 45.6993 0.0717 0.0107 1.0010 42.8093 21.3856 80.6691 52.6060 110.0183 6.8842 2.1194 11.1501 17.8207 13.0174 4.3136 0.1404 15.6010 35.1975 34.5428 9.5368 12.6482 53.9833 57.7502 3.9705 10.2960 115.5560 420.3926 141.4284 85.4942 2.4583 16.1973 77.5787 11.0560 10.7616 8.8843 18.0562 22.5170 3.7299 137.7296 50.2716 15.8110 11.8065 16.5971 3.7187 7.7907 38.0862 57.8905 221.3391 222.1713 131.1621 31.9885 224.0730 1.7137 19.0565 8.9640 54.0473 130.3762 57.8063 70.1747 6.3541 32.3685 9.1155 31.7486 5.5990 0.0145 0.2295 0.6417 0.0221 0.2955 0.5012 1.4671
temp: 298.150 k
press: 1.00000 atm
elementType: 17 8 8 8 8 7 7 7 6 6 6 6 6 6 6 6 6 6 6 6 6 6 6 6 6 6 6 6 6 6 6 6 1 1 1 1 1 1 1 1 1 1 1 1 1 1 1 1
symmnumber: 1
zpe: 919536.9 jmol-1
zpe.correction: 0.350233 hartree
zpe.thermalcorrener: 0.376147 hartree
zpe.thermalcorrenthalpy: 0.377092 hartree
zpe.thermalcorrgfe: 0.292120 hartree
zpe.sumelectzpe: -1847.247531 hartree
zpe.sumelectthermal: -1847.221617 hartree
zpe.sumelectthermalent: -1847.220673 hartree
zpe.sumelectthermalfe: -1847.305645 hartree
dipole: 1.7386 0.5677 -1.1219
dipole: 2.1456
quadrupole: -185.9020 -196.2486 -194.9497
quadrupole: -5.7444 -5.9055 0.5240
quadrupole: 6.4648 -3.8819 -2.5829 -5.7444 -5.9055 0.5240
hfenergy: -1847.5977644 hartree
pointgroup: C01 [X(C24H16Cl1N3O4)]
dipole: -0.6787554 0.2249505 0.4486546 debye
polarizability: 682.1561689|-14.2290069|318.3665217|-39.5982968|-8.4562785|138.0399972 unknown
InChI: InChI=1S/C24H16ClN3O4/c1-32-10-2-9-27-22(29)14-5-4-13-19-16(7-6-15(20(14)19)23(27)30)24(31)28-18-8-3-12(25)11-17(18)26-21(13)28/h3-8,11H,2,9-10H2,1H3
charge 0 multiplicity 1
48 atoms
Cl 8.806882 -1.364409 -0.597673
O  3.019785 2.849824 -0.217402
O  -3.708141 -2.366196 0.844655
O  -4.07854 2.285994 0.590558
O  -8.130252 -0.519474 -1.698618
N  3.164234 0.520203 -0.092881
N  -3.880768 -0.038444 0.728132
N  3.527858 -1.753997 0.004605
C  0.370021 0.274748 0.231716
C  -1.052376 0.168525 0.396807
C  1.16367 -0.925192 0.217045
C  0.962607 1.575159 0.086619
C  -1.656012 -1.120361 0.544089
C  -1.85308 1.353761 0.412359
C  2.59803 -0.787067 0.048959
C  2.434596 1.739324 -0.085824
C  0.547286 -2.18386 0.36295
C  -3.128079 -1.248108 0.714218
C  -3.332624 1.262627 0.578578
C  -0.856423 -2.27788 0.525445
C  0.151863 2.725286 0.105052
C  4.561212 0.340393 -0.235934
C  -1.252124 2.615833 0.266634
C  -5.359525 -0.150573 0.87024
C  4.757996 -1.080528 -0.171917
C  -6.051271 -0.286463 -0.504479
C  5.626742 1.242095 -0.406472
C  6.053129 -1.632046 -0.280755
C  -7.572002 -0.39205 -0.350719
C  6.921199 0.685789 -0.514761
C  7.108109 -0.719829 -0.451032
C  -9.587478 -0.621944 -1.686464
H  1.174268 -3.080105 0.347822
H  -1.348788 -3.248527 0.639335
H  0.63346 3.701523 -0.008996
H  -1.893586 3.50216 0.280596
H  -5.704581 0.759361 1.388511
H  -5.557957 -1.039106 1.492077
H  -5.818279 0.591873 -1.132315
H  -5.682952 -1.189067 -1.023516
H  5.461967 2.319758 -0.452366
H  6.213984 -2.711103 -0.233254
H  -7.846888 -1.28039 0.26385
H  -7.98244 0.515127 0.150345
H  7.788546 1.337882 -0.648556
H  -10.056587 0.280598 -1.238517
H  -9.929623 -1.517293 -1.123759
H  -9.899867 -0.711233 -2.738587
