program: Gaussian 09
title: 000092414
version: EM64L-G09RevD.01
frameworkgroup: C1[X(C16H13ClFNO5)]
method: RPBEPBE
basis: SDD
operation: Freq
keyword: #p
keyword: freq=noraman
keyword: PBEPBE/SDD
title: #p freq=noraman PBEPBE/SDD
converged: YES YES NO NO
title: Mulliken charges:
elementType: Cl F O O O O O N C C C C C C C C C C C C C C C C H H H H H H H H H H H H H
charge: 0.013759 -0.176771 -0.159524 -0.177377 -0.222026 -0.423707 -0.181332 -0.372476 0.146794 0.147601 -0.496313 -0.494126 -0.415921 -0.416364 0.069038 0.050897 0.351508 -0.426541 0.221639 0.513542 -0.339873 -0.348966 -0.340692 0.162566 0.251954 0.240840 0.251629 0.236458 0.212602 0.220164 0.215196 0.219109 0.277081 0.284523 0.250765 0.261510 0.392834
chargesum: 0.00000
title: Mulliken charges with hydrogens summed into heavy atoms:
elementType: Cl F O O O O O N C C C C C C C C C C C C C C C C
charge: 0.013759 -0.176771 -0.159524 -0.177377 -0.222026 -0.030873 -0.181332 -0.372476 0.146794 0.147601 -0.003518 -0.006039 0.016845 0.017942 0.069038 0.050897 0.351508 -0.149461 0.221639 0.513542 -0.055350 -0.348966 0.171582 0.162566
polarizability: 2.88851999e+02 1.24098725e+01 2.08860557e+02 8.92050749e+00 -1.54398811e+01 1.30709894e+02
1716.lowfreq: -4.5174 -0.0022 -0.0020 0.0004 2.9592 5.4722 20.2475 26.6584 31.5549
frequency: 20.2085 26.6185 31.5394 39.9800 53.3536 69.8237 99.7506 113.8035 123.2709 129.9882 133.4049 176.6401 188.2343 193.4183 211.5017 222.9569 244.2693 265.4014 273.9814 302.3890 323.2831 334.0546 394.6830 402.0042 429.3201 449.9680 456.8304 465.1166 489.1905 515.2221 532.2134 541.7561 581.7683 594.5753 622.8641 628.5977 646.8317 668.9257 701.8852 710.8899 734.4916 742.9808 750.2062 796.3268 817.7776 844.1607 850.1436 859.5041 864.9143 879.8631 895.7472 947.2334 955.7874 1006.7383 1015.0777 1034.4577 1055.4008 1062.4597 1076.9100 1079.5714 1095.7068 1124.7456 1154.3870 1168.9030 1205.5700 1209.7661 1230.1287 1230.4511 1243.5785 1258.9755 1265.3211 1266.6062 1330.8457 1337.8683 1340.3057 1353.3934 1372.1816 1386.3483 1391.2061 1407.1699 1446.4341 1451.5810 1451.8137 1469.3557 1471.1679 1496.4261 1595.5049 1607.9987 1627.4944 1668.5566 1678.7280 1709.2291 2967.4379 2974.3650 2974.6475 2987.8264 2991.3333 3026.4414 3032.3665 3033.9459 3055.4323 3061.6671 3185.9730 3188.7072 3528.2654
redmass: 7.0484 10.6913 6.1758 10.0535 6.5431 7.7413 3.8001 3.7852 5.8125 2.9795 8.5781 9.4320 9.7883 11.0753 8.8977 6.1715 3.3781 6.8139 1.9332 10.4817 5.7617 7.2406 10.0373 9.0532 3.4901 2.9355 3.1766 6.3248 9.0528 1.7484 6.4133 3.1888 4.5050 6.2321 7.7191 1.5292 9.3262 7.1212 3.4764 4.1424 4.7648 4.2394 7.3715 6.0699 1.7389 1.8801 2.5122 1.4670 2.8202 4.0732 1.5516 6.6839 2.6375 1.8813 4.5059 7.6125 3.1861 2.6943 3.3418 2.1983 1.9705 1.1536 2.1581 1.8145 2.7263 1.0819 1.3625 1.5580 1.4733 1.9665 3.3231 1.2793 1.3459 1.4891 6.0933 1.6751 3.1981 3.1310 3.0690 6.2996 1.1097 1.1239 1.0775 1.0908 1.0883 3.6005 10.6489 7.2630 12.7748 8.5480 12.3693 9.4302 1.0554 1.0651 1.0653 1.0663 1.0610 1.1043 1.0931 1.0942 1.0980 1.1039 1.0916 1.0932 1.0644
irintensity: 0.2457 0.6841 1.0243 0.3173 0.2434 1.9171 0.8330 1.0901 0.7859 4.3983 7.4923 1.3564 1.4610 0.8438 0.4727 0.3722 0.7402 0.6644 1.8320 2.7569 8.0168 2.8189 4.5551 5.0687 3.7808 2.2808 9.1663 12.7734 21.9970 39.3251 7.4978 2.7270 14.9958 10.0131 4.8220 129.0337 3.3489 2.6075 9.5325 8.9677 8.4209 9.3452 55.9579 27.3208 1.6573 6.2880 9.7877 40.7453 12.3501 3.3398 2.7563 52.2405 10.1321 7.2196 300.6046 38.2329 134.4260 4.3563 0.7662 1.4032 6.0562 1.7158 32.2807 64.3185 28.9978 1.2217 4.8116 5.7841 83.6962 131.1543 136.5613 8.8602 0.2709 5.0529 116.6404 10.9303 11.6186 3.5291 14.3569 180.2107 0.4634 126.7147 31.2135 12.0328 9.1199 357.4066 27.4880 20.6770 409.2918 43.1954 3.9451 211.7231 30.9319 15.1811 2.1859 29.9045 31.3466 12.1926 24.4645 2.3100 56.7712 44.8314 0.5287 1.8262 39.9420
temp: 298.150 k
press: 1.00000 atm
elementType: 17 9 8 8 8 8 8 7 6 6 6 6 6 6 6 6 6 6 6 6 6 6 6 6 1 1 1 1 1 1 1 1 1 1 1 1 1
symmnumber: 1
zpe: 692257.5 jmol-1
zpe.correction: 0.263667 hartree
zpe.thermalcorrener: 0.285606 hartree
zpe.thermalcorrenthalpy: 0.286550 hartree
zpe.thermalcorrgfe: 0.209871 hartree
zpe.sumelectzpe: -1606.547968 hartree
zpe.sumelectthermal: -1606.526029 hartree
zpe.sumelectthermalent: -1606.525085 hartree
zpe.sumelectthermalfe: -1606.601765 hartree
dipole: 4.9971 4.6443 0.5901
dipole: 6.8476
quadrupole: -132.5957 -135.6036 -148.9415
quadrupole: -3.9149 -3.1706 8.2268
quadrupole: 6.4512 3.4434 -9.8946 -3.9149 -3.1706 8.2268
hfenergy: -1606.8116352 hartree
pointgroup: C01 [X(C16H13Cl1F1N1O5)]
dipole: -1.8342081 -1.9195543 0.4569786 debye
polarizability: 286.6888647|16.5646325|213.2302782|-12.4365769|5.4018114|128.5033076 unknown
InChI: InChI=1S/C16H13ClFNO5/c17-10-5-11(18)12(6-13(10)24-7-14(20)21)19-15(22)8-3-1-2-4-9(8)16(19)23/h5-6,20H,1-4,7H2
charge 0 multiplicity 1
37 atoms
Cl 4.304919 2.775606 -0.687988
F  -0.863768 3.005294 -1.00102
O  -2.182118 1.857609 1.380255
O  -0.949767 -1.618324 -1.555556
O  3.734561 -0.039368 0.007819
O  4.903561 -3.370332 0.835835
O  6.109314 -1.45652 0.26276
N  -1.205243 0.317842 -0.171213
C  -3.456773 -0.0339 0.399961
C  -3.094171 -1.052042 -0.437394
C  -4.815964 0.129196 1.015277
C  -4.007074 -2.153198 -0.894555
C  -5.632085 -1.18183 0.849958
C  -5.480608 -1.782168 -0.573398
C  -2.274123 0.862891 0.628015
C  -1.653723 -0.882519 -0.82292
C  0.094366 0.886062 -0.296764
C  1.24999 0.105676 -0.058159
C  0.261869 2.232535 -0.682574
C  2.542194 0.663361 -0.191014
C  1.530873 2.822787 -0.787455
C  2.666569 2.035276 -0.542349
C  3.617038 -1.452038 0.334086
C  5.023562 -2.023153 0.455671
H  -4.721973 0.415121 2.080068
H  -5.338873 0.976693 0.526089
H  -3.867689 -2.341577 -1.975928
H  -3.725543 -3.099747 -0.38891
H  -5.283559 -1.923948 1.595361
H  -6.698174 -0.984969 1.064987
H  -5.839165 -1.043451 -1.317235
H  -6.119372 -2.678428 -0.674892
H  1.113622 -0.941031 0.220944
H  1.622501 3.872637 -1.075786
H  3.086901 -1.606796 1.295456
H  3.074381 -2.008591 -0.457063
H  5.807843 -3.778457 0.911833
