program: Gaussian 09
title: 000092433
version: EM64L-G09RevD.01
frameworkgroup: C1[X(C14H13ClN6O5S)]
method: RPBEPBE
basis: SDD
operation: Freq
keyword: #p
keyword: freq=noraman
keyword: PBEPBE/SDD
title: #p freq=noraman PBEPBE/SDD
converged: YES YES NO NO
title: Mulliken charges:
elementType: Cl S O O O O O N N N N N N C C C C C C C C C C C C C C H H H H H H H H H H H H H
charge: 0.067004 1.000288 -0.454894 -0.538777 -0.207843 -0.250810 -0.249868 -0.215415 0.029926 -0.682070 -0.414728 -0.142227 -0.047617 0.172311 0.203644 -0.301708 -0.167055 -0.299323 -0.228281 -0.165855 0.368303 0.030686 0.229952 0.243031 -0.415774 -0.510564 -0.509381 0.305115 0.270511 0.342604 0.241203 0.250486 0.331606 0.276484 0.239034 0.236246 0.234208 0.229203 0.262962 0.237384
chargesum: 0.00000
title: Mulliken charges with hydrogens summed into heavy atoms:
elementType: Cl S O O O O O N N N N N N C C C C C C C C C C C C C C
charge: 0.067004 1.000288 -0.454894 -0.538777 -0.207843 -0.250810 -0.249868 -0.215415 0.029926 -0.339466 -0.083122 -0.142227 -0.047617 0.172311 0.203644 -0.301708 0.138060 -0.028812 0.012921 0.084631 0.368303 0.030686 0.229952 0.243031 -0.139291 0.198924 0.220168
polarizability: 3.03005969e+02 2.89301890e+01 2.60480557e+02 2.41060055e+01 -6.29452494e+00 2.34267470e+02
1716.lowfreq: -5.0867 -2.3081 -0.0011 0.0009 0.0010 3.0555 8.7854 12.9716 24.3637
frequency: 8.3445 12.9497 24.3505 37.6871 55.1913 75.6267 77.5658 89.1925 100.6522 110.6618 124.1067 132.6332 134.4900 141.9072 149.4526 171.3350 189.3763 205.0133 209.7099 228.3446 229.8837 236.6180 246.1805 271.7030 277.2887 311.9613 314.0133 355.8625 369.3780 384.7603 401.5699 411.3940 436.9563 448.7731 479.8482 539.9131 553.4232 575.2860 589.3118 611.1522 613.4477 621.8252 627.1472 647.2255 660.8724 672.8953 692.3946 727.9792 744.9973 765.7134 766.3829 773.6783 790.8780 811.0858 836.9673 861.4365 863.7412 890.3118 919.8217 939.6611 949.5040 959.5770 972.2738 975.4883 984.3562 1020.6152 1029.4257 1052.7586 1110.9274 1112.7932 1115.7658 1121.2077 1139.1366 1141.9132 1165.7634 1168.5937 1214.0342 1254.1133 1276.8370 1286.5241 1309.3458 1323.6501 1328.4046 1342.6469 1359.8069 1404.2868 1413.3357 1434.6244 1438.0435 1447.7871 1452.3071 1458.8374 1464.3750 1465.6714 1493.7323 1502.1500 1523.6195 1532.0299 1568.8919 1637.2736 1646.4593 3001.7085 3009.5605 3103.6276 3115.5488 3143.8466 3150.3114 3162.7670 3176.4483 3190.9023 3197.9141 3221.4225 3491.7580 3536.2022
redmass: 5.5469 7.1319 9.8567 8.5065 7.1713 3.0275 6.4362 5.8588 4.9385 1.3103 5.9799 2.3753 6.9842 4.6095 1.4359 6.6623 6.9067 6.5822 8.4611 5.8565 6.8600 6.4961 6.3389 8.2980 8.6737 8.5330 9.0633 4.8805 5.6078 13.3722 7.9781 1.4658 3.6156 4.1767 7.2320 8.3038 5.9543 3.9090 5.4749 2.5540 7.4604 2.1981 7.0262 9.8031 11.4073 3.2464 6.1472 5.7138 3.7441 2.4435 2.1400 6.9053 13.1112 6.4399 1.6842 7.7405 1.4021 8.5150 10.0048 8.5594 1.3772 13.4080 6.6215 5.1636 1.3525 2.5447 2.8811 3.2955 1.2773 1.2537 1.8270 1.6700 1.6020 1.4963 1.7043 2.1541 2.8677 2.4599 2.0508 3.5909 5.3892 3.0370 2.1654 3.6466 3.2350 6.6836 1.8994 1.5712 2.5746 1.0562 1.0522 1.4363 1.1563 1.1571 2.7140 4.2165 7.9605 5.8771 5.4320 6.7237 8.8326 1.0294 1.0290 1.1046 1.1044 1.1046 1.1061 1.0884 1.0912 1.0969 1.1009 1.0946 1.0792 1.0763
irintensity: 0.2799 0.7644 0.2822 0.1512 1.0681 8.7654 2.7848 2.4487 1.5827 0.0547 0.9419 0.3546 1.7312 3.7470 0.0484 1.9821 2.2856 6.4408 1.4185 12.7048 2.4255 9.7295 2.2191 9.4179 7.8244 3.5973 21.9870 9.0341 10.1967 8.0762 77.4066 11.4385 41.8554 111.4643 1.7512 9.1700 181.0382 35.9575 4.2052 61.2921 2.5983 38.1208 16.8140 2.8912 0.2048 27.1436 68.3245 115.3214 10.4837 54.3077 41.4913 20.3045 157.6467 8.4357 49.8751 8.0767 0.7258 6.5965 3.1774 12.7761 4.1655 31.4783 26.2843 64.2980 2.1534 0.9726 82.2836 118.0390 13.6869 1.5950 241.7705 7.0242 19.8085 41.6997 49.2977 297.0283 2.8114 16.6461 229.4299 246.2455 147.3815 395.0199 80.7640 95.7991 298.9237 89.0753 92.5435 252.3295 12.0511 22.2522 14.1287 14.9048 76.0257 26.3548 575.8039 23.7042 288.2709 4.5334 580.6412 11.4229 164.5127 47.3000 32.2121 29.2002 20.9153 26.3078 23.5641 7.5067 4.3369 2.2906 8.5643 0.9989 27.6948 45.1576
temp: 298.150 k
press: 1.00000 atm
elementType: 17 16 8 8 8 8 8 7 7 7 7 7 7 6 6 6 6 6 6 6 6 6 6 6 6 6 6 1 1 1 1 1 1 1 1 1 1 1 1 1
symmnumber: 1
zpe: 715685.3 jmol-1
zpe.correction: 0.272590 hartree
zpe.thermalcorrener: 0.298831 hartree
zpe.thermalcorrenthalpy: 0.299775 hartree
zpe.thermalcorrgfe: 0.212360 hartree
zpe.sumelectzpe: -2101.877599 hartree
zpe.sumelectthermal: -2101.851359 hartree
zpe.sumelectthermalent: -2101.850415 hartree
zpe.sumelectthermalfe: -2101.937829 hartree
dipole: -0.8255 -0.5972 7.1222
dipole: 7.1947
quadrupole: -160.6570 -165.0869 -165.0792
quadrupole: 22.3671 19.4431 -3.6858
quadrupole: 2.9507 -1.4792 -1.4715 22.3671 19.4431 -3.6858
hfenergy: -2102.1501895 hartree
pointgroup: C01 [X(C14H13Cl1N6O5S1)]
dipole: 0.3196947 2.5496921 1.1870904 debye
polarizability: 302.2520746|-6.2640793|246.1013907|-37.5921427|-14.691604|249.4005303 unknown
InChI: InChI=1S/C14H13ClN6O5S/c1-25-9-7-10(26-2)18-13(17-9)19-14(22)20-27(23,24)12-11(15)16-8-5-3-4-6-21(8)12/h3-7,19-20H,1-2H3
charge 0 multiplicity 1
40 atoms
Cl -2.679283 -3.067137 -0.914944
S  -2.161181 0.34106 -2.242288
O  -2.010246 -0.878325 -3.28256
O  -2.822493 1.765176 -2.696246
O  0.119065 -0.979318 -0.528399
O  6.396696 1.008821 -0.68478
O  3.88899 -1.67824 2.365069
N  -3.472908 0.662878 0.239064
N  -3.739615 -1.484699 1.044486
N  -0.497055 0.955407 -1.682445
N  1.753651 0.62804 -1.185786
N  4.051621 0.811585 -0.945256
N  2.776845 -0.536815 0.629171
C  -2.956861 -0.234267 -0.716762
C  -3.944873 -0.156723 1.313974
C  -3.137421 -1.528048 -0.178642
C  -3.59542 2.046889 0.25739
C  -4.529419 0.465756 2.443862
C  -4.16602 2.645316 1.374415
C  -4.63332 1.859412 2.476431
C  0.449848 0.095245 -1.080225
C  2.898586 0.261356 -0.45314
C  5.189169 0.494723 -0.261727
C  3.941105 -0.845387 1.272375
C  5.202205 -0.35082 0.87092
C  6.382938 1.874583 -1.883607
C  2.551215 -2.199812 2.74699
H  -3.261793 2.583666 -0.632951
H  -4.883844 -0.173236 3.255723
H  -0.282676 1.869937 -2.098581
H  -4.262222 3.733633 1.387101
H  -5.081627 2.355107 3.342211
H  1.959615 1.301906 -1.927697
H  6.122081 -0.603531 1.39582
H  5.98042 1.328001 -2.752929
H  7.438911 2.139239 -2.036608
H  5.770896 2.774886 -1.705461
H  2.765813 -2.927184 3.542755
H  2.056878 -2.671496 1.882813
H  1.91483 -1.378785 3.116865
