program: Gaussian 09
title: 000092424
version: EM64L-G09RevD.01
frameworkgroup: C1[X(C19H18N2O2)]
method: RPBEPBE
basis: SDD
operation: Freq
keyword: #p
keyword: freq=noraman
keyword: PBEPBE/SDD
title: #p freq=noraman PBEPBE/SDD
converged: YES YES NO NO
title: Mulliken charges:
elementType: O O N N C C C C C C C C C C C C C C C C C C C H H H H H H H H H H H H H H H H H H
charge: -0.231589 -0.231650 -0.065538 -0.065507 -0.742509 0.566951 0.566353 -0.666182 -0.569691 -0.570223 -0.665371 0.367356 0.360740 0.361170 0.366812 0.055173 0.055424 -0.813477 -0.792756 -0.792684 -0.813380 -0.038717 -0.038645 0.233465 0.233103 0.247359 0.255314 0.255509 0.247537 0.233366 0.261515 0.246673 0.249073 0.243914 0.228350 0.243873 0.249026 0.228354 0.261427 0.233342 0.246741
chargesum: 0.00000
title: Mulliken charges with hydrogens summed into heavy atoms:
elementType: O O N N C C C C C C C C C C C C C C C C C C C
charge: -0.231589 -0.231650 -0.065538 -0.065507 -0.275941 0.566951 0.566353 -0.418823 -0.314377 -0.314714 -0.417834 0.367356 0.360740 0.361170 0.366812 0.055173 0.055424 -0.071922 -0.071419 -0.071431 -0.071869 -0.038717 -0.038645
polarizability: 2.89401246e+02 -5.91566269e-01 1.98819184e+02 3.91219913e+01 -7.61394308e-02 1.82525002e+02
1716.lowfreq: -5.9250 -4.4963 -0.0008 -0.0005 -0.0004 5.5722 15.0176 15.8865 25.8180
frequency: 13.4846 15.7387 25.8098 30.4669 39.6658 68.5055 73.5126 100.0408 101.0830 136.9322 139.5443 143.8376 146.2377 163.2570 174.5920 205.8260 227.7690 229.8007 259.0139 261.9890 266.8249 276.0327 280.9037 340.2738 352.5170 411.8872 438.8619 446.3822 446.6639 484.1559 488.0843 512.0985 513.4427 514.8775 536.4314 552.0999 558.8520 566.9599 582.2967 610.2177 671.8408 697.9448 700.2518 736.3563 750.9655 863.3008 888.7011 895.5826 900.0868 930.8931 936.9306 959.5548 961.6467 986.9313 1006.5231 1007.4457 1010.1328 1025.4750 1042.6889 1042.7437 1047.7553 1048.0874 1048.9610 1049.3456 1110.7904 1111.3618 1176.2289 1186.7789 1187.7043 1255.9496 1260.5892 1299.5015 1321.0912 1332.8667 1372.7357 1375.2315 1404.1046 1404.4582 1407.3440 1407.7808 1425.0232 1427.0229 1428.9288 1429.5795 1463.2842 1463.7660 1464.4391 1468.9015 1469.4335 1479.3130 1480.0571 1491.2425 1492.0962 1602.9806 1606.7553 1614.0825 1618.1593 2179.0554 2179.6148 2977.0585 2984.3884 2984.5321 2989.0428 2989.2313 3024.0277 3063.0135 3063.1921 3068.0150 3068.1734 3096.7295 3096.7835 3099.8761 3100.0365 3123.0629 3123.3147 3132.6167 3133.0092
redmass: 4.7874 6.5286 4.8790 7.7659 7.4802 5.5200 6.2580 1.0338 1.0357 1.6576 1.8818 1.7820 1.9428 3.0453 4.0741 4.3593 2.8895 2.9175 2.9423 3.2250 2.7984 4.5401 3.6409 7.0328 4.3520 7.1662 5.0587 12.0760 11.8690 3.3003 4.6168 3.0979 3.3668 4.8098 5.8153 4.1337 4.3292 5.2403 4.1384 4.9325 5.3340 4.5145 4.6967 4.3662 3.1840 1.3644 1.6201 1.3157 1.3439 2.3083 3.4911 2.5196 2.8505 2.2819 8.4045 8.9897 1.7082 1.8400 1.7746 1.7942 1.5450 1.5634 1.5578 1.5540 6.3096 7.7388 1.4961 1.1604 1.4439 1.3074 1.3957 1.6248 6.7804 7.4843 5.6536 6.0496 1.2529 1.2509 1.2423 1.2431 2.7182 2.5810 2.1507 2.2315 1.0767 1.0465 1.0680 1.0454 1.0449 1.1411 1.1569 1.3451 1.3428 5.6622 5.6854 8.4378 8.2362 12.6492 12.6481 1.0598 1.0380 1.0380 1.0372 1.0372 1.1005 1.0968 1.0968 1.0973 1.0973 1.0994 1.0994 1.0998 1.0999 1.0916 1.0916 1.0919 1.0921
irintensity: 1.3928 1.2426 0.3174 0.7693 1.2633 3.2005 0.0794 0.6721 0.5084 2.6921 3.1943 0.8331 1.6226 4.6281 0.5288 1.0313 0.5188 0.0083 4.0018 0.2071 3.3599 0.5337 2.3393 0.0676 1.4706 2.3980 0.1636 2.9186 6.4417 3.3768 0.2136 0.0349 0.0008 0.0316 1.6340 0.6079 0.1320 0.8683 12.3205 0.5097 6.3815 1.4861 0.3847 5.6074 7.6044 32.3235 13.8954 0.9100 1.9769 0.9790 0.2680 1.5781 0.5916 10.5930 7.0261 13.1495 0.7001 24.8896 1.2377 3.1106 9.2792 8.2508 4.0843 2.3039 144.3241 336.9203 15.3295 16.4774 27.4954 1.0770 1.5542 1.0486 3.2737 6.6652 4.3090 3.0735 17.1902 14.9466 11.0511 10.0032 1.0860 3.7647 25.7745 1.8494 26.6323 16.5039 0.5373 17.2108 14.7078 23.8089 19.8060 113.5954 35.3889 19.9196 0.1368 6.9829 2.3027 265.3893 144.3409 24.2320 21.1903 12.9938 15.7095 16.1334 9.3216 9.3834 9.3271 12.4196 10.5300 13.6658 13.9247 16.0962 17.2647 13.0394 11.1785 2.7285 11.1346
temp: 298.150 k
press: 1.00000 atm
elementType: 8 8 7 7 6 6 6 6 6 6 6 6 6 6 6 6 6 6 6 6 6 6 6 1 1 1 1 1 1 1 1 1 1 1 1 1 1 1 1 1 1
symmnumber: 1
zpe: 834164.8 jmol-1
zpe.correction: 0.317717 hartree
zpe.thermalcorrener: 0.341415 hartree
zpe.thermalcorrenthalpy: 0.342359 hartree
zpe.thermalcorrgfe: 0.260944 hartree
zpe.sumelectzpe: -993.063952 hartree
zpe.sumelectthermal: -993.040253 hartree
zpe.sumelectthermalent: -993.039309 hartree
zpe.sumelectthermalfe: -993.120724 hartree
dipole: -0.0210 -5.6996 -0.0367
dipole: 5.6997
quadrupole: -182.3899 -140.3806 -130.6290
quadrupole: 0.0293 -10.0392 -0.0365
quadrupole: -31.2567 10.7525 20.5041 0.0293 -10.0392 -0.0365
hfenergy: -993.3816682 hartree
pointgroup: C01 [X(C19H18N2O2)]
dipole: 0.0157506 2.2423681 0.0098877 debye
polarizability: 269.2064918|-0.2406931|198.8159088|-57.2813058|0.4226005|202.7230309 unknown
InChI: InChI=1S/C19H18N2O2/c1-12-5-16(6-13(2)18(12)22-10-20)9-17-7-14(3)19(23-11-21)15(4)8-17/h5-8H,9H2,1-4H3
charge 0 multiplicity 1
41 atoms
O  -4.915706 -0.753646 0.233506
O  4.91298 -0.771602 -0.252381
N  -5.621176 -2.21947 2.162545
N  5.585291 -2.249872 -2.183849
C  0.005554 2.276295 0.015088
C  -1.279847 1.454432 0.108714
C  1.287489 1.451072 -0.090927
C  -2.2412 1.735088 1.107744
C  1.558854 0.419465 0.842799
C  -1.545313 0.422653 -0.826402
C  2.239044 1.726476 -1.100686
C  -3.459844 1.015251 1.200832
C  2.749287 -0.341606 0.784469
C  -2.739554 -0.333334 -0.779977
C  3.453671 1.001397 -1.205921
C  -3.651543 -0.007925 0.24841
C  3.651399 -0.021172 -0.2542
C  -4.495756 1.336659 2.259751
C  3.047456 -1.448037 1.775502
C  -3.031288 -1.439897 -1.772802
C  4.479374 1.316521 -2.276589
C  -5.238822 -1.509081 1.274046
C  5.217998 -1.5342 -1.293243
H  -0.055246 2.949587 -0.862588
H  0.068258 2.936082 0.902801
H  -2.051333 2.537033 1.831767
H  0.82602 0.193666 1.626205
H  -0.804972 0.192427 -1.601379
H  2.044735 2.52832 -1.823627
H  -4.239218 2.272587 2.782429
H  -4.57001 0.535396 3.0189
H  -5.502049 1.453029 1.818161
H  3.97099 -1.239273 2.345127
H  3.202701 -2.416199 1.265327
H  2.217018 -1.565648 2.490699
H  -3.197938 -2.406331 -1.26299
H  -3.946621 -1.227249 -2.354125
H  -2.192705 -1.562976 -2.477498
H  4.541232 0.513793 -3.03532
H  4.221583 2.252943 -2.797748
H  5.49101 1.428546 -1.846271
