program: Gaussian 09
title: 000092389
version: EM64L-G09RevD.01
frameworkgroup: C1[X(C12H9ClN2O3)]
method: RPBEPBE
basis: SDD
operation: Freq
keyword: #p
keyword: freq=noraman
keyword: PBEPBE/SDD
title: #p freq=noraman PBEPBE/SDD
converged: YES YES NO NO
title: Mulliken charges:
elementType: Cl O O O N N C C C C C C C C C C C C H H H H H H H H H
charge: -0.012176 -0.277875 -0.217816 -0.273286 -0.657778 0.024755 0.500405 0.447787 0.256269 -0.553073 -0.348496 -0.375070 0.354545 -0.360528 -0.378928 -0.199496 -0.191359 -0.242904 0.281549 0.288497 0.269834 0.262998 0.324264 0.371734 0.235131 0.235385 0.235634
chargesum: 0.00000
title: Mulliken charges with hydrogens summed into heavy atoms:
elementType: Cl O O O N N C C C C C C C C C C C C
charge: -0.012176 -0.277875 -0.217816 -0.273286 0.038220 0.024755 0.500405 0.447787 0.256269 -0.553073 -0.066947 -0.086574 0.354545 -0.090694 -0.115930 0.035634 0.044026 -0.007270
polarizability: 2.82161411e+02 -2.76603745e+00 1.73646915e+02 -1.16468154e+01 -6.02869352e+00 9.44373921e+01
1716.lowfreq: -8.7120 -4.1585 -0.7399 0.0011 0.0017 0.0019 23.0894 37.5899 57.4068
frequency: 23.0131 37.5881 57.4021 71.5752 106.1863 124.8595 170.4068 198.8699 244.7687 258.2855 290.0821 310.3456 334.6035 378.2348 410.7557 414.3960 423.3231 489.7761 491.4315 545.2261 558.5624 584.3056 601.3667 608.9772 630.8005 656.9119 676.0620 693.7494 718.3926 730.9901 755.0645 769.5787 796.7116 801.5311 814.8865 839.6883 914.2909 968.3438 974.0290 987.2662 992.8141 999.1056 1019.8387 1076.8677 1086.1785 1099.4175 1148.0694 1164.5290 1172.7081 1186.6094 1213.5262 1243.4552 1290.3741 1308.4800 1334.1683 1382.7213 1418.1392 1441.2853 1453.6163 1470.6012 1490.2048 1537.8366 1577.3504 1596.6711 1603.6171 1631.7161 3136.2550 3145.3430 3158.6676 3168.0401 3174.0727 3178.3576 3192.1676 3399.6052 3618.5908
redmass: 5.2876 4.7888 6.5778 13.2964 8.8743 6.1689 9.8874 7.5757 7.4936 5.4711 6.2135 7.9284 8.5646 4.7962 2.9327 7.9461 7.6869 3.6710 4.2410 5.9165 1.2351 7.3752 4.2493 6.1062 5.4151 7.8488 5.8245 2.3015 4.9367 5.2597 1.2084 1.7601 6.0407 1.8714 3.5746 1.2476 1.4022 1.3242 1.3333 6.1032 1.3101 3.9067 2.0845 1.5209 5.4233 2.0841 1.7256 1.6250 1.0986 1.8035 4.2645 1.9630 3.8908 1.3537 6.5278 9.4126 5.5922 2.2714 3.0063 2.3118 5.8199 2.4076 2.0845 6.1545 6.4943 7.3190 1.0853 1.0891 1.0935 1.0969 1.0880 1.1005 1.0969 1.0530 1.0971
irintensity: 0.4728 0.3143 0.8806 0.8301 2.8400 0.6884 0.2734 3.2070 2.4962 7.0152 0.2644 5.4964 1.0324 2.6389 0.0811 4.8409 1.0411 15.8733 5.5553 4.1549 123.0911 4.9543 14.1722 0.8324 5.0175 10.9537 10.9870 19.4536 3.5971 31.7785 162.7492 70.8290 8.7278 25.7246 21.5458 1.8559 5.7836 2.2844 0.6805 18.8769 0.7642 92.6617 37.5032 13.5656 27.6348 8.6516 181.9617 14.4115 1.7259 14.2822 875.1003 37.9792 138.9877 6.1573 126.7899 0.2035 11.9834 5.2936 140.5322 94.4702 32.6782 84.3500 124.5882 51.1573 146.9817 349.4361 1.7234 8.2084 24.4391 12.0790 1.5158 7.3942 2.8278 95.3589 88.2067
temp: 298.150 k
press: 1.00000 atm
elementType: 17 8 8 8 7 7 6 6 6 6 6 6 6 6 6 6 6 6 1 1 1 1 1 1 1 1 1
symmnumber: 1
zpe: 499881.4 jmol-1
zpe.correction: 0.190395 hartree
zpe.thermalcorrener: 0.205648 hartree
zpe.thermalcorrenthalpy: 0.206592 hartree
zpe.thermalcorrgfe: 0.146000 hartree
zpe.sumelectzpe: -1256.562661 hartree
zpe.sumelectthermal: -1256.547408 hartree
zpe.sumelectthermalent: -1256.546464 hartree
zpe.sumelectthermalfe: -1256.607057 hartree
dipole: 5.0079 1.2474 0.2908
dipole: 5.1691
quadrupole: -114.1841 -112.7289 -107.3544
quadrupole: -22.1418 -2.6600 -2.4916
quadrupole: -2.7616 -1.3064 4.0681 -22.1418 -2.6600 -2.4916
hfenergy: -1256.7530563 hartree
pointgroup: C01[X(C12H9Cl1N2O3)]
dipole: -1.9931258 0.3899561 -0.1062759 debye
polarizability: 281.8707583|10.0510804|171.5466725|-6.775486|15.7647941|96.8282872 unknown
InChI: InChI=1S/C12H9ClN2O3/c13-11-10(18-8-4-2-1-3-5-8)7-6-9(12(11)14)15(16)17/h1-7H,14H2
charge 0 multiplicity 1
27 atoms
Cl 0.594029 3.172611 0.172472
O  -1.377698 0.992487 0.359724
O  4.089924 -2.254855 -0.051535
O  4.949135 -0.144965 -0.094022
N  3.334291 1.92712 0.005727
N  3.928887 -0.971518 -0.035947
C  -0.092022 0.469726 0.211954
C  2.336099 0.993813 0.067202
C  2.582799 -0.431158 0.048903
C  0.963647 1.393628 0.148859
C  0.187847 -0.930354 0.20193
C  1.51175 -1.359351 0.122199
C  -2.530161 0.218221 0.026342
C  -2.641403 -0.449127 -1.213494
C  -3.596093 0.256324 0.94709
C  -3.851156 -1.110584 -1.520958
C  -4.801205 -0.406134 0.622525
C  -4.930946 -1.094119 -0.606798
H  -0.63161 -1.648449 0.276384
H  1.761566 -2.423027 0.12165
H  -1.810049 -0.440133 -1.925593
H  -3.472375 0.799649 1.888328
H  3.099514 2.918624 0.022489
H  4.298319 1.577356 -0.05269
H  -3.950528 -1.629665 -2.480246
H  -5.636199 -0.383562 1.33076
H  -5.866662 -1.606358 -0.853455
