program: Gaussian 09
title: 000092391
version: EM64L-G09RevD.01
frameworkgroup: C1[X(C12H4Cl6)]
method: RPBEPBE
basis: SDD
operation: Freq
keyword: #pfreq=noraman
keyword: PBEPBE/SDD
title: #p freq=noraman PBEPBE/SDD
converged: NO NO NO NO
title: Mulliken charges:
elementType: Cl Cl Cl Cl Cl Cl C C C C C C C C C C C C H H H H
charge: 0.025588 -0.008277 -0.008273 0.004489 -0.031067 -0.019166 0.447494 0.484217 -0.289739 -0.336667 -0.257789 -0.257755 -0.046051 -0.080932 -0.224663 -0.224678 -0.227354 -0.093549 0.279439 0.288546 0.288548 0.287639
chargesum: 0.00000
title: Mulliken charges with hydrogens summed into heavy atoms:
elementType: Cl Cl Cl Cl Cl Cl C C C C C C C C C C C C
charge: 0.025588 -0.008277 -0.008273 0.004489 -0.031067 -0.019166 0.447494 0.484217 -0.289739 -0.057228 -0.257789 -0.257755 -0.046051 -0.080932 0.063883 0.063870 0.060285 -0.093549
polarizability: 2.54277259e+02 8.31097466e+00 1.63343098e+02 1.35173492e-02 -4.52048920e-03 1.44418720e+02
1716.lowfreq: -0.0013 -0.0012 0.0028 4.2048 4.5496 7.9166 14.5750 32.4736 41.5143
frequency: 14.5359 32.4712 41.5117 76.0523 88.8831 132.2048 147.9296 155.0124 175.2303 184.8078 193.8583 197.3170 222.7996 246.1595 312.6882 317.3106 331.9318 347.8548 390.1592 411.0091 453.4565 464.0501 500.5141 516.6375 541.0148 542.9940 580.5468 593.5743 725.3626 726.2311 734.2364 755.7106 779.3917 818.9369 858.4279 866.1220 870.3334 884.8799 994.1446 1042.4215 1100.2222 1110.9889 1120.6278 1178.3497 1183.9246 1265.6625 1337.8311 1350.4007 1366.3461 1372.7620 1400.0583 1453.6742 1547.4503 1553.3147 1577.9529 1590.9902 3174.2470 3182.5142 3186.4774 3188.0926
redmass: 21.4324 25.9535 19.8538 28.1642 24.5755 29.2126 10.8576 10.0536 20.9018 25.5710 4.7397 26.3419 5.0652 17.5560 23.3858 8.7080 9.6421 32.8871 12.5412 8.1959 6.2706 8.1677 8.5090 5.0762 5.0354 8.1283 3.9766 5.2427 9.8855 4.9918 6.9456 10.7778 10.7757 8.4137 1.4611 1.3732 1.4371 1.4257 7.9763 4.7305 1.9992 1.8858 5.2706 1.5666 1.8842 2.2737 4.8696 11.3393 4.6774 3.2772 3.0583 4.6988 9.7457 7.5295 8.5505 9.0664 1.0935 1.0937 1.0933 1.0942
irintensity: 0.0044 0.0211 0.0390 0.0225 0.0248 0.0150 0.2593 0.2554 0.4195 0.5979 0.0002 0.5384 0.0447 0.4192 0.2618 0.8276 0.1747 0.0100 8.3638 6.1638 3.8400 19.0255 6.0399 0.0273 4.9674 13.5238 35.7455 0.5401 9.5482 1.8664 10.3480 78.1358 44.3347 80.1406 38.7365 0.0636 25.1293 3.3061 30.3951 5.7292 6.3486 41.8473 11.2819 12.9075 8.6363 13.8365 30.5621 0.5259 26.1526 47.2975 111.6937 50.5658 92.9948 56.8819 14.4687 113.7032 0.0917 1.6771 3.5174 1.1162
temp: 298.150 k
press: 1.00000 atm
elementType: 17 17 17 17 17 17 6 6 6 6 6 6 6 6 6 6 6 6 1 1 1 1
symmnumber: 1
zpe: 314083.1 jmol-1
zpe.correction: 0.119628 hartree
zpe.thermalcorrener: 0.136820 hartree
zpe.thermalcorrenthalpy: 0.137764 hartree
zpe.thermalcorrgfe: 0.071216 hartree
zpe.sumelectzpe: -3218.779167 hartree
zpe.sumelectthermal: -3218.761975 hartree
zpe.sumelectthermalent: -3218.761031 hartree
zpe.sumelectthermalfe: -3218.827579 hartree
dipole: -0.8731 1.0147 0.0012
dipole: 1.3386
quadrupole: -140.8367 -148.3531 -144.0783
quadrupole: -0.4168 0.0003 -0.0033
quadrupole: 3.5860 -3.9304 0.3444 -0.4168 0.0003 -0.0033
hfenergy: -3218.898795 hartree
pointgroup: C01 [X(C12H4Cl6)]
dipole: 0.3429277 0.3996887 0.0021469 debye
dipolederiv: -0.2178755 0.2530806 0.0013592 0.255117 -0.5182781 -0.0027813 0.0013697 -0.0027495 -0.0049766 -0.274775 -0.0013666 0.236056 0.0064616 -0.0310042 0.0000963 0.241284 -0.0005946 -0.6042942 -0.2748558 0.0011052 -0.2361225 0.0089908 -0.0310714 0.0060474 -0.2412731 0.0066229 -0.6041316 -0.3469006 -0.3202515 -0.0018369 -0.3542611 -0.4983348 -0.0027152 -0.0020594 -0.002725 -0.0235081 -0.3247684 0.294722 0.0016452 0.3543223 -0.6732562 -0.0035039 0.0019648 -0.0035067 -0.0478448 -0.9088081 0.0011543 0.0000534 0.0077094 -0.0441222 0.0004415 0.0000936 0.0004337 -0.1230392 0.2995998 0.086365 0.0004124 0.0927778 0.01899 -0.0000828 0.0003749 0.000003 0.0300597 0.1563602 0.0454615 0.0002373 0.0496944 -0.024941 0.0024441 0.000237 0.0024235 -0.4899364 0.0066724 -0.4892589 -0.0026472 -0.5106656 0.5833037 0.0032232 -0.0027294 0.0031929 -0.0304769 -0.3048663 0.1377844 0.0007983 0.0903103 -0.22168 -0.0008942 0.000557 -0.0008829 -0.0618168 0.4374515 -0.0049628 -0.3511398 -0.007067 -0.0340677 -0.0140689 -0.2080626 0.0008629 0.9512911 0.4374939 -0.0085973 0.3511402 -0.0092139 -0.0340874 0.0036903 0.208079 -0.0112024 0.9511932 0.4796509 0.4941468 0.002829 0.6457916 0.6483465 0.0039392 0.0036865 0.0039362 -0.0260427 0.4797782 -0.4634234 -0.0025679 -0.5251656 1.0227736 0.0060354 -0.0028923 0.006056 -0.0510216 -0.55655 -0.002574 0.1862461 -0.0039588 -0.0693492 -0.0005607 0.1222104 -0.0037995 -0.2771669 -0.5565642 -0.0005734 -0.1862381 -0.0026787 -0.0694266 0.0027465 -0.1221663 0.005952 -0.2770319 -0.189618 0.0273006 0.000147 -0.0302571 -0.4362634 -0.0021131 -0.0001784 -0.0020989 -0.0667812 1.404306 -0.0097529 -0.0001129 -0.0124863 -0.0498012 -0.0021273 -0.0001591 -0.0021106 0.3433898 0.0826767 -0.0434002 -0.0002565 -0.0688132 0.0318509 -0.0005955 -0.0003837 -0.0006178 0.1382924 0.0704882 -0.0005191 -0.0269493 0.0030493 0.1679095 0.0019225 -0.0257506 0.0003057 0.0532207 0.0704932 -0.000829 0.0269381 0.0027455 0.1679229 -0.0007351 0.0257748 0.0009271 0.0532064 0.0306107 0.0043888 0.0000089 0.0075972 0.0945864 -0.0004084 0.0000232 -0.000428 0.1674155 unknown
polarizability: 254.3006372|-8.181963|163.3188532|-0.038757|0.1279822|144.4195856 unknown
InChI: InChI=1S/C12H4Cl6/c13-5-1-7(12(18)10(17)4-5)11-8(15)2-6(14)3-9(11)16/h1-4H
charge 0 multiplicity 1
22 atoms
Cl -0.587339 -2.642632 -0.014409
Cl 0.708609 0.095239 2.793761
Cl 0.708167 0.124491 -2.792423
Cl -3.849038 -2.486481 -0.014287
Cl -3.584083 3.039155 0.01702
Cl 5.485049 0.062679 0.00006
C  -0.667835 0.146979 0.000917
C  0.830751 0.113086 0.000667
C  -1.434566 -1.045999 -0.005808
C  -1.333235 1.396624 0.007932
C  1.582949 0.099664 1.20336
C  1.582768 0.112249 -1.202215
C  -2.846105 -0.98188 -0.005632
C  -2.738739 1.433053 0.008016
C  2.99084 0.083505 1.232091
C  2.990659 0.09696 -1.231339
C  -3.513743 0.259207 0.001261
C  3.671679 0.082643 0.000287
H  -0.750912 2.321737 0.013204
H  3.532141 0.070792 2.180687
H  3.531834 0.094644 -2.180087
H  -4.605852 0.297585 0.001337
