program: Gaussian 09
title: 000092386
version: EM64L-G09RevD.01
frameworkgroup: C1[X(C15H20O3)]
method: RPBEPBE
basis: SDD
operation: Freq
keyword: #pfreq=noraman
keyword: PBEPBE/SDD
title: #p freq=noraman PBEPBE/SDD
converged: YES YES NO NO
title: Mulliken charges:
elementType: O O O C C C C C C C C C C C C C C C H H H H H H H H H H H H H H H H H H H H
charge: -0.280775 -0.265675 -0.257934 -0.033851 -0.410613 -0.291850 -0.710964 -0.710101 0.224027 0.502029 -0.372121 -0.266738 -0.351071 -0.394987 0.326327 -0.361857 -0.364534 -0.536897 0.204079 0.212802 0.213087 0.235750 0.237772 0.212752 0.213120 0.215134 0.211846 0.213076 0.215082 0.246245 0.260384 0.234611 0.235331 0.253454 0.243880 0.248885 0.225166 0.225129
chargesum: 0.00000
title: Mulliken charges with hydrogens summed into heavy atoms:
elementType: O O O C C C C C C C C C C C C C C C
charge: -0.280775 -0.265675 -0.257934 0.170228 0.015277 0.181672 -0.069958 -0.070096 0.224027 0.502029 -0.125877 -0.006354 -0.116461 -0.159656 0.326327 -0.108403 -0.120654 0.162283
polarizability: 3.63710790e+02 5.10632254e+00 1.56616601e+02 1.88674982e-01 5.55527218e-01 1.02488179e+02
1716.lowfreq: -7.1475 0.0007 0.0010 0.0013 4.5693 12.2308 18.3782 25.4755 37.0694
frequency: 17.9869 22.8960 36.8949 45.5607 62.9842 97.4856 101.2913 103.6095 126.4800 155.5070 197.8490 204.1485 219.1330 228.2528 237.9625 245.5998 250.8871 305.3917 332.3781 358.0918 376.6635 380.2915 421.0957 432.2657 480.4052 517.2436 538.2509 563.6380 633.2869 674.5439 679.8827 741.4372 744.5143 776.0030 793.2090 814.7761 834.7128 837.8769 886.7008 907.4974 913.7282 947.8579 952.7449 960.7759 970.2665 977.3756 984.2227 987.7579 1000.3582 1010.5343 1025.8694 1112.4376 1112.8293 1121.1311 1141.5216 1149.0731 1158.1053 1180.7698 1193.7898 1210.8350 1216.7089 1243.2613 1279.6421 1285.9321 1294.7461 1307.6924 1319.2237 1332.1129 1339.7984 1379.0916 1379.7345 1385.6709 1398.3520 1433.8750 1437.4655 1463.1210 1466.0600 1468.9662 1473.4761 1479.3809 1483.8632 1487.0879 1492.2404 1504.2547 1570.1344 1597.1189 1624.2816 1643.9543 2964.6431 2966.1135 2970.5899 2973.6093 2989.7583 3007.0314 3038.1327 3056.5146 3063.1454 3066.8460 3070.5668 3071.9121 3077.4656 3096.8990 3128.6087 3131.3933 3142.5443 3157.9757 3164.9209 3170.9058
redmass: 3.8671 3.0453 4.7650 4.2076 5.8976 3.4621 3.0942 2.4222 3.5470 4.2393 2.2688 5.8471 2.0496 1.3415 3.2319 1.0603 1.3919 4.9349 3.6183 2.0818 3.9117 2.5370 2.9228 4.9449 3.7020 2.3956 4.8780 2.9500 6.9591 4.7432 6.9888 3.9135 5.3170 1.1577 3.3333 1.3032 5.2707 1.5936 1.9019 5.4758 1.1936 1.3677 1.2854 2.6850 1.3591 2.9959 8.7553 1.7574 2.6226 1.1924 2.0886 1.4301 1.2680 2.9000 2.0238 1.7823 1.3288 1.2419 1.9100 1.2080 1.6225 2.9675 1.1195 1.5338 1.5142 1.9856 1.4185 1.4636 1.4122 2.0008 1.2113 2.3104 1.2238 3.5616 1.2088 1.0856 1.0455 1.0496 1.0797 1.0546 1.0775 1.0523 1.0566 2.5154 6.8177 10.1949 6.7474 5.6777 1.0802 1.0327 1.0352 1.0362 1.0636 1.0564 1.1020 1.1041 1.1002 1.1006 1.0988 1.0988 1.1068 1.0897 1.0900 1.0992 1.0884 1.0912 1.0941 1.0965
irintensity: 0.5144 0.5330 0.9001 0.9483 0.4414 0.4418 0.6106 0.7192 9.3566 0.5054 0.0881 0.0108 2.3157 0.3473 2.9892 0.2847 0.2345 20.3621 7.4052 0.0919 2.4600 0.6132 0.1357 1.8699 12.4460 22.1512 37.2584 2.5012 2.6319 0.4112 2.0408 0.0724 6.5478 2.8608 2.3048 17.6403 17.6759 75.6485 5.5901 15.2937 2.6671 2.4849 0.2177 25.9242 0.9087 115.4158 44.1801 0.1199 1.6540 44.3188 51.4665 129.0284 7.6959 731.1410 27.2287 5.5704 22.6323 100.0664 6.3719 0.2092 9.6648 292.2843 0.1339 4.2893 2.0242 98.2391 21.4756 1.8068 1.9270 8.8486 22.2392 8.3276 16.3733 50.8067 7.1808 6.6717 1.4458 14.3271 56.1771 2.7901 17.6486 8.0044 19.8592 145.3729 41.7697 512.6798 95.9427 185.5827 21.4868 83.1489 40.6481 20.2106 27.1486 30.2340 5.8791 44.4267 21.9386 9.5262 64.0561 123.6790 48.9204 2.2307 18.4431 15.0816 7.0215 8.3889 17.2934 7.5751
temp: 298.150 k
press: 1.00000 atm
elementType: 8 8 8 6 6 6 6 6 6 6 6 6 6 6 6 6 6 6 1 1 1 1 1 1 1 1 1 1 1 1 1 1 1 1 1 1 1 1
symmnumber: 1
zpe: 828973.2 jmol-1
zpe.correction: 0.315739 hartree
zpe.thermalcorrener: 0.335166 hartree
zpe.thermalcorrenthalpy: 0.336110 hartree
zpe.thermalcorrgfe: 0.265314 hartree
zpe.sumelectzpe: -807.885835 hartree
zpe.sumelectthermal: -807.866408 hartree
zpe.sumelectthermalent: -807.865464 hartree
zpe.sumelectthermalfe: -807.936260 hartree
dipole: -2.8249 -0.6064 -0.0344
dipole: 2.8895
quadrupole: -66.4340 -109.3248 -111.7784
quadrupole: -14.3386 -0.2406 -0.0270
quadrupole: 29.4118 -13.4791 -15.9327 -14.3386 -0.2406 -0.0270
hfenergy: -808.2015738 hartree
pointgroup: C01 [X(C15H20O3)]
dipole: -1.1118445 -0.2351405 -0.0288838 debye
polarizability: 363.7251701|4.5982383|156.4355311|1.521867|2.9955034|102.6548683 unknown
InChI: InChI=1S/C15H20O3/c1-12(2)10-11-18-15(16)9-6-13-4-7-14(17-3)8-5-13/h4-9,12H,10-11H2,1-3H3
charge 0 multiplicity 1
38 atoms
O  2.633554 -0.351497 -0.062954
O  1.894137 1.864679 0.085148
O  -6.275852 -0.940891 -0.127827
C  6.461411 -0.77205 -0.091334
C  4.937333 -1.083219 -0.144987
C  4.037511 0.148604 -0.017317
C  6.922341 0.132599 -1.261254
C  6.896259 -0.18099 1.272942
C  1.632747 0.634686 -0.000239
C  -2.223281 0.325568 -0.039901
C  0.299754 0.008818 -0.048541
C  -0.83235 0.779835 -0.0056
C  -2.600316 -1.051525 -0.119324
C  -3.264783 1.293323 0.009892
C  -4.96874 -0.446513 -0.095039
C  -3.946521 -1.433965 -0.146281
C  -4.625466 0.926909 -0.016865
C  -7.374739 0.029564 -0.079591
H  6.974453 -1.749961 -0.206772
H  4.680459 -1.789766 0.668216
H  4.70134 -1.59199 -1.100001
H  4.182024 0.687248 0.936594
H  4.176887 0.86927 -0.843002
H  8.024404 0.221975 -1.275513
H  6.509606 1.154946 -1.170905
H  6.601818 -0.278101 -2.237204
H  6.481003 0.832524 1.428464
H  7.997474 -0.098008 1.329864
H  6.559512 -0.818329 2.112112
H  0.279489 -1.083027 -0.1184
H  -0.672896 1.866524 0.063276
H  -1.828428 -1.827304 -0.159323
H  -2.999274 2.355778 0.071162
H  -4.242014 -2.485739 -0.206547
H  -5.395766 1.702526 0.023026
H  -8.292015 -0.575421 -0.11691
H  -7.342085 0.714495 -0.948584
H  -7.350389 0.615626 0.859221
