program: Gaussian 09
title: 000092384
version: EM64L-G09RevD.01
frameworkgroup: C1[X(C12H4Cl6O)]
method: RPBEPBE
basis: SDD
operation: Freq
keyword: #p
keyword: freq=noraman
keyword: PBEPBE/SDD
title: #p freq=noraman PBEPBE/SDD
converged: YES YES NO NO
title: Mulliken charges:
elementType: Cl Cl Cl Cl Cl Cl O C C C C C C C C C C C C H H H H
charge: 0.049970 0.049282 0.046881 0.046571 0.011366 0.010824 -0.262323 0.500009 0.500147 -0.319107 -0.318842 -0.345213 -0.344711 -0.034452 -0.034376 -0.195540 -0.195975 -0.131365 -0.130793 0.282246 0.281899 0.266868 0.266634
chargesum: 0.00000
title: Mulliken charges with hydrogens summed into heavy atoms:
elementType: Cl Cl Cl Cl Cl Cl O C C C C C C C C C C C C
charge: 0.049970 0.049282 0.046881 0.046571 0.011366 0.010824 -0.262323 0.500009 0.500147 -0.319107 -0.318842 -0.062967 -0.062812 -0.034452 -0.034376 0.071328 0.070659 -0.131365 -0.130793
polarizability: 3.06964276e+02 3.55968191e-01 1.76718559e+02 -4.76474449e+00 1.37545948e-01 1.16267396e+02
1716.lowfreq: -0.0034 -0.0015 -0.0013 2.0251 2.4803 5.3102 13.1516 21.0070 35.3237
frequency: 13.0730 20.9951 35.3235 77.3166 78.0768 98.4552 114.8989 138.2883 193.9167 200.4604 202.0442 211.3519 227.0744 233.9447 235.5919 297.5884 322.0303 328.7461 329.8257 385.1391 424.4782 468.7993 471.8555 500.1814 505.4635 506.1442 550.1379 562.0267 581.5255 663.7612 674.1442 710.7428 732.2943 738.7545 743.7450 800.3989 814.1730 824.2372 920.7210 934.7030 945.0045 1040.0106 1045.7218 1142.4779 1145.3622 1163.3254 1164.7119 1212.4910 1253.0872 1344.3962 1361.0722 1362.7293 1365.6295 1423.4160 1433.4049 1556.7805 1564.8398 1571.2690 1585.5497 3163.6977 3165.2555 3183.8541 3184.3761
redmass: 13.0355 13.8241 18.3753 30.4296 28.9733 9.1573 10.1127 15.3489 27.1810 31.3484 32.0905 19.6405 7.8137 6.9807 11.1925 8.7727 8.4905 27.6485 26.7116 9.3582 14.7941 8.2981 9.8510 5.8654 5.2241 4.6050 6.1543 5.4855 8.9292 7.3825 9.5252 7.3442 6.7840 8.1708 9.8140 1.3719 1.5151 6.1567 8.1920 1.3591 1.3313 8.8935 8.3056 1.8773 1.5220 1.9386 1.8163 2.6962 4.0920 6.4234 7.1351 6.8318 6.3407 2.7893 2.8523 8.2164 8.7381 7.4976 7.8162 1.0891 1.0886 1.0972 1.0972
irintensity: 1.6148 0.1763 0.1160 0.0039 0.2453 1.2596 0.0684 0.0171 0.0245 0.0087 0.0139 0.0477 4.6152 1.6156 6.3515 0.0530 7.0130 1.0117 0.0084 0.5674 9.9839 9.8943 2.6629 12.4285 0.8526 0.1980 3.3370 11.2461 11.0048 10.8792 8.8446 3.1026 0.0177 19.2075 65.2417 66.2795 50.3265 24.6605 122.0176 4.8624 0.0015 0.9952 122.0742 0.9732 2.0474 68.7629 1.0439 19.2839 346.7348 16.9767 10.1330 25.0470 26.9677 597.9958 53.7602 0.9359 3.3035 88.4711 6.5467 4.0251 0.2147 0.3877 0.0026
temp: 298.150 k
press: 1.00000 atm
elementType: 17 17 17 17 17 17 8 6 6 6 6 6 6 6 6 6 6 6 6 1 1 1 1
symmnumber: 1
zpe: 324492.4 jmol-1
zpe.correction: 0.123593 hartree
zpe.thermalcorrener: 0.141688 hartree
zpe.thermalcorrenthalpy: 0.142632 hartree
zpe.thermalcorrgfe: 0.073350 hartree
zpe.sumelectzpe: -3293.889939 hartree
zpe.sumelectthermal: -3293.871844 hartree
zpe.sumelectthermalent: -3293.870899 hartree
zpe.sumelectthermalfe: -3293.940182 hartree
dipole: -0.0544 -3.2503 -0.0309
dipole: 3.2509
quadrupole: -167.7563 -146.2805 -147.3561
quadrupole: 0.0594 2.3572 0.1008
quadrupole: -13.9586 7.5171 6.4415 0.0594 2.3572 0.1008
hfenergy: -3294.0135319 hartree
pointgroup: C01 [X(C12H4Cl6O1)]
dipole: -0.0197699 0.008829 -1.2788148 debye
dipolederiv: -0.0201105 0.0328322 -0.0525071 0.0359345 -0.1763468 0.2893483 -0.0471675 0.2783449 -0.4254994 -0.0194984 0.0304508 0.0485245 0.0341785 -0.1762695 -0.2891189 0.0432855 -0.2791535 -0.4277766 -0.5149309 -0.1864378 0.2032097 -0.2388751 -0.084782 0.0986156 0.2414911 0.0992469 -0.1019516 -0.5201645 -0.1813541 -0.20507 -0.2320343 -0.0792874 -0.0958151 -0.2438048 -0.096525 -0.1029902 -0.6414695 0.1267155 -0.275383 0.1272083 -0.0592867 0.0782117 -0.3275423 0.0909231 -0.1999227 -0.6387145 0.1317113 0.2742675 0.1340966 -0.0622007 -0.0815895 0.3265311 -0.093752 -0.2001703 -2.6133923 0.1730986 0.0031474 -0.1301326 -0.1489639 -0.0021437 0.0079333 -0.0022515 -0.2811671 1.785764 -0.1168345 0.1581562 0.0475872 0.0678069 0.0516787 0.7907065 0.0013977 0.015907 1.7935287 -0.1264369 -0.1640627 0.02215 0.0708474 -0.0500884 -0.7995269 -0.0004914 0.0164691 -0.3921797 -0.040637 0.0732313 -0.0984245 0.2028768 -0.4329202 0.1555008 -0.4289094 0.6265173 -0.4002819 -0.0329241 -0.0640295 -0.0917456 0.202257 0.4330663 -0.1507394 0.4317808 0.6289178 -0.2663889 -0.0127071 0.073382 0.1109131 -0.1093394 -0.0506439 -0.2484341 -0.0488403 -0.0632418 -0.268584 -0.0144538 -0.0733207 0.1167759 -0.1109868 0.0512854 0.2540151 0.0480748 -0.0647483 0.6485598 0.3341889 -0.3928474 0.4101229 0.0867418 -0.0774037 -0.4691944 -0.0733665 0.0216668 0.6610901 0.3248383 0.3924592 0.3979415 0.0784212 0.0739615 0.4692838 0.0701225 0.0255289 -0.0776322 0.0992275 -0.1427294 0.0148307 -0.0472786 -0.0401668 -0.0117985 -0.0211666 -0.0455219 -0.0723975 0.1012363 0.145394 0.0148271 -0.0484777 0.0383815 0.0103428 0.0209637 -0.0452199 0.7022831 -0.2723434 0.5421638 -0.240618 -0.0396614 -0.0857148 0.5117996 -0.1046261 0.187619 0.6930618 -0.2804569 -0.5418054 -0.2481301 -0.0353825 0.0909511 -0.5094086 0.1081079 0.1847623 0.0130441 -0.0466833 0.0217233 -0.1034798 0.1263798 0.0318282 0.0420862 0.0393387 0.0823238 0.012027 -0.0449118 -0.0227424 -0.1025752 0.1270067 -0.0316259 -0.0444325 -0.0392585 0.0818936 0.0680774 0.0008362 -0.0087486 0.0095138 0.1078314 0.0771499 -0.0148246 0.0829458 0.0436754 0.0683089 0.0010451 0.0075872 0.0099353 0.1080945 -0.0772471 0.0138977 -0.082906 0.0429289 unknown
polarizability: 306.988657|4.2254828|116.2416273|0.5089828|0.0274694|176.7199465 unknown
InChI: InChI=1S/C12H4Cl6O/c13-5-1-3-7(11(17)9(5)15)19-8-4-2-6(14)10(16)12(8)18/h1-4H
charge 0 multiplicity 1
23 atoms
Cl -2.217298 -1.337697 2.490347
Cl 2.239048 1.334762 2.497226
Cl -5.119832 -0.834436 1.128677
Cl 5.135046 0.796045 1.135708
Cl -5.306738 0.944134 -1.594556
Cl 5.299693 -0.97709 -1.592773
O  0.002367 0.019542 1.10711
C  -1.207637 0.191531 0.405264
C  1.209047 -0.172853 0.406149
C  -2.374037 -0.359494 0.990868
C  2.383174 0.359499 0.994171
C  -1.30013 0.968288 -0.770271
C  1.292094 -0.947176 -0.771809
C  -3.637388 -0.136088 0.39069
C  3.643616 0.120377 0.394486
C  -2.554702 1.184218 -1.369933
C  2.544252 -1.179159 -1.370692
C  -3.71648 0.63461 -0.792414
C  3.713171 -0.647784 -0.790926
H  -0.399714 1.411649 -1.204061
H  0.386503 -1.376816 -1.208571
H  -2.638095 1.787923 -2.277171
H  2.619741 -1.781386 -2.27962
