program: Gaussian 09
title: 000092410
version: EM64L-G09RevD.01
frameworkgroup: C1[X(C24H27ClN2O2S)]
method: RPBEPBE
basis: SDD
operation: Freq
keyword: #p
keyword: freq=noraman
keyword: PBEPBE/SDD
title: #p freq=noraman PBEPBE/SDD
converged: YES YES NO NO
title: Mulliken charges:
elementType: Cl S O O N N C C C C C C C C C C C C C C C C C C C C C C C C H H H H H H H H H H H H H H H H H H H H H H H H H H H
charge: -0.064558 0.203161 -0.264161 -0.248575 -0.078852 -0.087216 -0.361832 -0.369592 -0.374148 -0.377377 -0.348856 -0.349529 -0.489896 -0.281369 -0.283894 0.214826 0.464652 0.383043 -0.398559 -0.360462 -0.362605 -0.371063 -0.259487 -0.286365 0.296055 -0.115575 -0.263763 -0.239306 -0.234507 -0.753319 0.197503 0.191730 0.186494 0.208768 0.201312 0.193092 0.188892 0.207381 0.219920 0.179406 0.219696 0.197730 0.266502 0.205300 0.233403 0.241146 0.220435 0.275162 0.254830 0.254125 0.250492 0.232462 0.260268 0.233964 0.246280 0.248106 0.248733
chargesum: 0.00000
title: Mulliken charges with hydrogens summed into heavy atoms:
elementType: Cl S O O N N C C C C C C C C C C C C C C C C C C C C C C C C
charge: -0.064558 0.203161 -0.264161 -0.248575 -0.078852 -0.087216 0.027401 0.025671 0.020256 0.018896 0.050469 0.067897 -0.018095 0.193179 -0.063458 0.214826 0.464652 0.383043 -0.398559 -0.360462 -0.087443 -0.116234 -0.005363 -0.035872 0.296055 -0.115575 -0.031300 0.020961 -0.000542 -0.010201
polarizability: 3.98616096e+02 -2.00036838e+01 3.49075850e+02 4.14413647e+01 3.58792866e+00 2.16919630e+02
1716.lowfreq: -11.2997 -5.6230 -2.2762 0.0006 0.0009 0.0016 6.4931 10.6969 15.5309
frequency: -6.0727 9.8015 15.1924 22.2053 29.2685 35.6969 42.9856 45.5303 60.6560 72.2830 90.7851 96.4991 111.6216 129.6927 144.9661 157.4583 165.2897 183.3533 206.6030 208.2459 226.0709 251.0793 255.5376 263.3199 275.9064 283.2092 308.9621 332.6699 345.8509 367.7060 372.4300 386.1760 396.0713 416.4564 417.6994 442.1857 448.0203 466.0566 485.3694 491.3600 498.5197 520.9931 538.3068 569.9504 596.4449 613.1573 622.1724 629.9988 651.5952 664.0945 704.9344 715.4867 743.7252 751.6744 761.7578 766.3530 784.7793 787.6242 794.5775 809.7586 844.0872 850.3413 854.3072 873.3835 883.5194 921.0098 928.2846 944.2117 948.2804 950.3033 984.7330 1002.2582 1004.8194 1016.2763 1019.7094 1026.1277 1039.6177 1045.3903 1045.9051 1051.9958 1053.7650 1078.3173 1085.8805 1086.2836 1095.9948 1110.1470 1121.8422 1132.4608 1136.4015 1143.1499 1146.3918 1158.0959 1174.9412 1177.1689 1194.4967 1196.4727 1203.3869 1229.3710 1238.8759 1255.6790 1260.8086 1263.9727 1273.8665 1288.9591 1291.8954 1303.3142 1309.2536 1318.5694 1337.3507 1346.6179 1350.5335 1363.4517 1365.5535 1370.6649 1371.1931 1384.7603 1389.4253 1396.5154 1399.9217 1424.3219 1446.3142 1449.1969 1454.3561 1455.1314 1457.1456 1457.8419 1459.8531 1461.6248 1464.5248 1471.7249 1478.3556 1482.8906 1555.7353 1568.6824 1584.5477 1600.2795 1630.5327 1647.2282 2834.7808 2853.2038 2863.5376 2868.0538 2877.0064 2893.1043 2949.3841 3006.2649 3018.7328 3022.1897 3031.1655 3034.6835 3037.8503 3042.0294 3043.6537 3054.0213 3080.9494 3091.3887 3099.7193 3132.5505 3139.1696 3143.1786 3147.7530 3156.8466 3165.3168 3170.3211 3177.8404
redmass: 3.8499 6.3743 5.3269 5.4831 4.6632 4.6775 6.0250 1.0350 3.7396 4.9659 6.0448 3.7019 5.6824 4.1676 2.5632 4.0307 5.1059 2.9883 5.1274 4.2024 3.6466 2.6332 2.9577 2.7759 4.9150 6.1894 6.7040 2.3841 3.3041 5.3489 3.7926 3.5656 3.4963 3.2744 4.4346 3.7829 3.8233 3.7980 3.1052 5.4619 4.0507 5.2722 5.1247 3.1446 3.8378 4.2417 2.7478 4.6111 4.3568 6.4877 5.4331 3.7540 2.5422 4.3594 3.3435 1.5991 1.7897 2.0961 1.3376 1.3480 2.1367 2.0626 1.5536 1.3570 1.4642 5.1888 2.4091 1.3481 4.3349 1.3874 1.3185 2.2733 2.1966 2.8468 2.3581 5.5296 3.1240 1.7319 2.6085 1.7309 3.5046 2.0472 1.9495 2.4122 2.6330 2.4757 1.7709 2.6180 1.5923 2.4792 2.5842 1.8060 1.0926 2.0910 1.1912 1.3099 2.3963 1.7204 1.6167 1.2917 1.3697 1.3333 1.2780 1.3132 1.5073 1.2921 1.3468 1.3582 1.2811 1.3924 1.9445 5.2616 1.4982 6.2811 1.4898 1.2389 1.4208 2.8103 1.5070 2.2396 2.6487 1.0835 1.0802 1.0611 1.0840 1.0532 1.1168 2.4053 1.0968 1.0870 1.0996 1.0854 6.8543 6.3706 7.3274 6.7738 8.2025 10.0608 1.0707 1.0712 1.0702 1.0702 1.0687 1.0693 1.0671 1.0382 1.0585 1.0868 1.0909 1.0876 1.0901 1.0889 1.0874 1.0925 1.0882 1.1083 1.0941 1.0852 1.1025 1.0899 1.0896 1.0946 1.0920 1.1005 1.0965
irintensity: 0.7336 0.0633 0.0847 1.4703 0.3118 0.3789 0.4014 0.6632 0.0281 0.2254 1.0885 0.8274 0.5593 0.7259 0.7343 0.1955 1.4660 7.3664 1.6780 2.5882 2.2396 0.7100 0.1467 4.0368 1.9017 5.9063 1.1502 9.5428 8.4804 0.4422 2.0778 5.3440 0.1601 0.8345 4.5414 10.5657 0.7579 20.5357 3.5602 7.7978 8.0686 10.1823 9.9925 3.1008 3.3513 1.5334 2.2402 3.4185 5.9344 4.2539 6.5054 4.6607 17.2139 18.8523 19.8888 52.3483 13.5436 14.1130 5.4213 43.8675 5.6307 10.2437 6.3518 2.2979 15.8996 24.4629 16.9360 0.1689 46.7535 5.0641 0.1682 157.5160 7.0923 56.2747 4.2718 49.9836 7.1571 13.5189 6.2232 4.4669 3.6504 3.6733 34.5922 20.5566 1.1038 0.9335 9.8568 56.7303 4.0926 25.6314 95.0039 7.1944 2.0346 7.8372 48.0265 68.8044 297.1486 0.8453 1.5431 6.7874 16.4928 2.3357 5.1888 17.2149 6.5623 12.6896 3.2292 6.8121 26.6537 6.3743 4.3448 9.9598 12.0868 1.0271 6.3918 56.2678 6.1811 30.4928 3.2538 40.9695 82.9470 0.5492 0.4074 18.5815 2.6475 16.5121 10.6966 18.5766 3.0915 5.2822 9.1747 12.5038 6.8845 13.5376 4.0886 15.3826 2.6599 200.4226 60.7911 75.8350 15.5852 19.0079 170.0244 160.4423 16.1069 3.2228 17.9407 8.6435 21.7454 57.6942 64.1651 41.0911 13.8660 17.9240 19.7242 34.0252 9.5619 0.2625 9.2053 5.1517 3.4442 21.8786 0.5479 23.2629 3.1691
temp: 298.150 k
press: 1.00000 atm
elementType: 17 16 8 8 7 7 6 6 6 6 6 6 6 6 6 6 6 6 6 6 6 6 6 6 6 6 6 6 6 6 1 1 1 1 1 1 1 1 1 1 1 1 1 1 1 1 1 1 1 1 1 1 1 1 1 1 1
symmnumber: 1
zpe: 1200521.2 jmol-1
zpe.correction: 0.457254 hartree
zpe.thermalcorrener: 0.485647 hartree
zpe.thermalcorrenthalpy: 0.486591 hartree
zpe.thermalcorrgfe: 0.393282 hartree
zpe.sumelectzpe: -2046.593095 hartree
zpe.sumelectthermal: -2046.564702 hartree
zpe.sumelectthermalent: -2046.563758 hartree
zpe.sumelectthermalfe: -2046.657067 hartree
dipole: -1.1771 3.3049 0.9705
dipole: 3.6401
quadrupole: -190.0040 -195.6449 -190.9834
quadrupole: -8.4090 -4.9607 -8.9641
quadrupole: 2.2068 -3.4341 1.2273 -8.4090 -4.9607 -8.9641
hfenergy: -2047.0503495 hartree
pointgroup: C01 [X(C24H27Cl1N2O2S1)]
dipole: -0.4768733 -1.1293618 -0.7403151 debye
polarizability: 399.8127933|29.919248|335.3496012|-32.6564021|39.8994115|229.449182 unknown
InChI: InChI=1S/C24H27ClN2O2S/c1-18(28)29-16-15-27-13-11-26(12-14-27)10-4-6-20-21-5-2-3-7-23(21)30-24-9-8-19(25)17-22(20)24/h2-3,5-9,17H,4,10-16H2,1H3
charge 0 multiplicity 1
57 atoms
Cl 5.921189 4.014269 2.076315
S  5.384269 -1.177096 -1.710747
O  -8.349045 0.308809 -0.117416
O  -9.049377 1.544151 1.730777
N  -1.771837 0.45194 -0.754711
N  -4.674906 0.564503 -0.803668
C  -2.557743 0.648352 0.488733
C  -2.505766 1.020484 -1.913783
C  -3.944178 -0.00189 0.357793
C  -3.889784 0.364949 -2.047344
C  -0.382698 0.954667 -0.658658
C  -6.07256 0.086225 -0.907604
C  0.524447 0.03288 0.195955
C  -6.97542 0.866338 0.055842
C  1.932367 0.575224 0.277396
C  3.12324 -0.105985 0.207077
C  4.408086 0.659176 0.219332
C  3.232153 -1.59018 0.100463
C  5.504606 0.275321 -0.601352
C  4.214344 -2.197794 -0.731291
C  4.567084 1.802772 1.049924
C  2.386873 -2.45474 0.851688
C  6.700998 1.027825 -0.626264
C  4.31066 -3.601665 -0.858091
C  -9.310987 0.749811 0.79916
C  5.757585 2.544845 1.005039
C  2.473304 -3.856541 0.732515
C  6.835054 2.182817 0.172993
C  3.428535 -4.433798 -0.136403
C  -10.668246 0.160248 0.481026
H  -2.024165 0.183715 1.337359
H  -2.68893 1.736774 0.717572
H  -2.643225 2.126942 -1.813075
H  -1.920514 0.827832 -2.832111
H  -4.519235 0.188106 1.282045
H  -3.814241 -1.108767 0.252524
H  -3.749176 -0.720866 -2.278232
H  -4.434454 0.82991 -2.889875
H  0.033595 0.998201 -1.682884
H  -0.343746 1.997935 -0.247987
H  -6.429111 0.258203 -1.939389
H  -6.171278 -1.007935 -0.705153
H  0.502922 -0.98355 -0.234521
H  0.095186 -0.048549 1.217791
H  -6.678216 0.753725 1.113288
H  -6.986291 1.942177 -0.190027
H  1.995308 1.673127 0.337476
H  3.763556 2.092642 1.732628
H  1.6712 -2.013698 1.551986
H  7.533657 0.710527 -1.262304
H  5.07983 -4.038848 -1.503515
H  1.806235 -4.495606 1.320598
H  7.757592 2.769285 0.160893
H  3.504645 -5.521932 -0.234474
H  -11.221022 -0.019411 1.416396
H  -11.248004 0.885312 -0.119294
H  -10.572966 -0.770971 -0.097011
