program: Gaussian 09
title: 000092376
version: EM64L-G09RevD.01
frameworkgroup: C1[X(C6H13N3O)]
method: RPBEPBE
basis: SDD
operation: Freq
keyword: #p
keyword: freq=noraman
keyword: PBEPBE/SDD
title: #p freq=noraman PBEPBE/SDD
converged: NO YES NO NO
title: Mulliken charges:
elementType: O N N N C C C C C C H H H H H H H H H H H H H
charge: -0.290989 -0.363396 -0.072628 0.046979 -0.041364 -0.038267 -0.354197 -0.386976 -0.729638 -0.729669 0.212849 0.215617 0.220412 0.233219 0.255211 0.232916 0.261314 0.220154 0.228957 0.214269 0.228389 0.223435 0.213403
chargesum: 0.00000
title: Mulliken charges with hydrogens summed into heavy atoms:
elementType: O N N N C C C C C C
charge: -0.290989 -0.102082 -0.072628 0.046979 0.171484 0.177350 0.099434 0.101151 -0.066258 -0.064442
polarizability: 1.12733399e+02 6.29312175e-01 9.51377532e+01 -5.68451960e+00 1.09643013e+00 6.72778973e+01
1716.lowfreq: -6.5806 -3.3119 -0.0006 -0.0003 -0.0002 12.2837 65.3425 126.5473 151.5958
frequency: 65.3347 126.5368 151.5927 210.5488 220.2743 233.0389 241.6220 299.7188 339.2665 381.7718 403.6291 436.6735 458.4533 469.5987 519.5848 626.3532 699.6971 828.8661 847.2637 865.9611 903.4351 931.8380 944.8643 971.8434 1012.6309 1074.9249 1093.0398 1126.1202 1142.3621 1162.2976 1191.4019 1196.0259 1246.0622 1292.0202 1302.5441 1312.3796 1317.0438 1331.0269 1344.7468 1360.7423 1371.6529 1386.8884 1390.0563 1434.8813 1444.2980 1451.8814 1470.2534 1476.0035 1479.1183 1480.1154 2858.2847 2867.0900 2980.5905 2981.1889 2989.1315 2995.5619 3073.1863 3074.2551 3077.1485 3084.2615 3090.0761 3090.5897 3446.4652
redmass: 4.9131 3.0641 2.3708 1.1098 1.1913 2.3227 2.7019 3.1870 4.5518 3.5487 3.6566 4.6642 2.4043 2.1186 1.9970 1.8494 4.9631 3.6033 1.9518 2.3587 1.4818 2.0026 1.8665 1.7642 2.2370 1.9248 2.0158 2.3088 2.4103 2.7844 1.5804 1.9662 2.6039 1.3018 1.3927 1.3366 1.5386 1.7057 2.4697 1.6501 1.3549 1.2424 1.2434 1.2593 1.0958 1.0951 1.0535 1.0820 1.0723 1.0533 1.0822 1.0813 1.0362 1.0362 1.0630 1.0612 1.0986 1.0988 1.1003 1.0993 1.0995 1.0999 1.0751
irintensity: 2.9167 1.8457 1.2462 0.4170 0.8092 2.6607 1.9303 2.2106 0.0573 2.3637 2.1246 4.4865 13.6444 6.1255 46.5213 68.3688 3.0062 8.0939 15.0616 2.5685 1.2831 36.0750 37.7908 4.0374 117.2345 0.8306 3.0450 4.3642 17.8284 29.7055 10.1081 10.9527 49.0887 23.6419 1.8275 96.3241 33.1502 15.9914 32.5930 48.4515 1.3115 28.4832 11.8583 14.3793 3.4091 7.1678 28.6657 7.7398 0.4938 8.7847 43.4959 96.3495 28.6562 23.6958 36.5132 36.2616 23.4584 39.1236 8.5402 0.4952 35.2355 34.5140 1.2023
temp: 298.150 k
press: 1.00000 atm
elementType: 8 7 7 7 6 6 6 6 6 6 1 1 1 1 1 1 1 1 1 1 1 1 1
symmnumber: 1
zpe: 512457.0 jmol-1
zpe.correction: 0.195185 hartree
zpe.thermalcorrener: 0.205626 hartree
zpe.thermalcorrenthalpy: 0.206570 hartree
zpe.thermalcorrgfe: 0.159811 hartree
zpe.sumelectzpe: -475.037835 hartree
zpe.sumelectthermal: -475.027394 hartree
zpe.sumelectthermalent: -475.026450 hartree
zpe.sumelectthermalfe: -475.073209 hartree
dipole: -5.0983 1.1735 0.1407
dipole: 5.2335
quadrupole: -74.2399 -57.3430 -60.5704
quadrupole: 4.5441 4.9188 -1.4641
quadrupole: -10.1888 6.7081 3.4807 4.5441 4.9188 -1.4641
hfenergy: -475.23302 hartree
pointgroup: C01 [X(C6H13N3O1)]
dipole: -2.0510159 0.0181744 0.1803267 debye
dipolederiv: -0.9889696 -0.0217252 0.226667 -0.8657531 -0.4027451 0.2469134 0.2435208 -0.004902 -0.2865862 -0.4050364 -0.0626768 0.1099553 -0.0684012 -0.7288388 -0.0268018 0.2375646 -0.0423923 -0.5180325 -0.9206685 -0.1464655 0.1720732 0.2239977 -0.1593186 -0.0670725 0.171627 0.0973334 -0.2997641 1.4578491 0.1049829 -0.530541 0.5118564 -0.0252463 -0.1256847 -0.5860807 -0.047897 0.1086206 0.2495374 -0.1869637 -0.0565281 -0.111068 0.4613122 0.1389001 0.0164138 0.0878817 0.3636218 0.4427621 0.2165332 -0.0949162 0.161318 0.3818186 -0.1170732 0.0215778 -0.0789369 0.3538719 0.1832133 0.1752373 -0.0264287 0.2082205 0.247738 -0.0720491 -0.0446612 -0.0850733 0.2603695 -0.1305867 -0.0435523 0.053126 -0.1020987 0.138631 0.0539657 0.0476692 0.0406689 0.2390506 -0.0200473 -0.0820246 0.0183904 -0.0356233 -0.0510363 0.0181813 -0.0078431 -0.0093102 0.0733793 0.006473 0.0424191 0.0163929 0.0063535 -0.0926381 -0.028644 -0.0083597 0.001367 0.0752929 -0.0187908 0.0528248 0.0783142 -0.0042523 -0.0572453 0.0192343 0.0271409 -0.0894121 -0.2447904 -0.0393529 -0.0604603 0.0607522 -0.0045358 -0.0380508 -0.0407943 0.0464639 0.0759315 -0.2365032 0.0090359 -0.0671546 0.058819 -0.0626392 0.0553613 -0.0071761 0.0488614 0.0677029 -0.134391 0.0607269 0.0901659 0.0140106 0.0220656 -0.0581846 -0.0233627 0.0200374 -0.0728934 0.081418 0.0696948 -0.1190112 0.0058299 -0.0181482 0.0220757 0.0054585 0.0137895 0.0554342 0.0939555 0.0646869 0.0493136 0.0552593 0.0757472 0.0496309 -0.003914 0.0156778 -0.045494 -0.1199947 0.0123795 0.0223413 -0.0775962 0.0244598 0.123736 0.0124286 -0.229392 0.038319 0.222612 0.0664684 0.0933976 0.0311993 0.0297172 -0.1343656 -0.0424055 0.024024 -0.0556625 0.0866526 0.0794827 -0.0157663 0.0125636 0.0033188 0.0987619 -0.0380492 0.0704843 0.0306913 -0.1325292 -0.1363111 -0.0110243 -0.0932196 0.0548763 0.0753527 0.0436848 -0.1093666 0.0286868 0.0291856 0.0854983 0.0214179 0.0283489 -0.0012173 0.0918108 0.0388798 0.0551568 -0.0434594 -0.1323011 -0.0005319 -0.1423771 0.0380835 -0.0811428 -0.062002 0.0216634 0.0381805 0.0351502 0.0903591 -0.1275132 0.0905684 -0.1005553 0.0329488 0.0634424 -0.0062827 -0.1124863 0.0162662 0.0265028 unknown
polarizability: 110.7928618|4.3307449|96.2193238|-8.3892604|-0.1262959|68.1368638 unknown
InChI: InChI=1S/C6H13N3O/c1-5-3-9(8-10)4-6(2)7-5/h5-7H,3-4H2,1-2H3
charge 0 multiplicity 1
23 atoms
O  3.067906 0.388905 -0.596071
N  -1.671421 0.232651 0.059548
N  1.063606 -0.289524 0.187953
N  2.292335 -0.615412 -0.36406
C  -1.207405 -1.117354 -0.342785
C  -0.740656 1.331653 -0.298849
C  0.122163 -1.396509 0.405105
C  0.59842 1.087664 0.442608
C  -2.267596 -2.171748 0.009529
C  -1.343559 2.688639 0.096168
H  -0.987126 -1.167503 -1.439642
H  -0.51369 1.335559 -1.394827
H  -0.09698 -1.493976 1.486565
H  0.603766 -2.318857 0.039394
H  1.391913 1.770915 0.093062
H  0.441618 1.224287 1.529962
H  -2.636608 0.422148 -0.241809
H  -1.919698 -3.186101 -0.255769
H  -2.492088 -2.144036 1.091032
H  -3.208763 -1.9859 -0.541247
H  -1.570313 2.707346 1.177367
H  -0.64418 3.511768 -0.134391
H  -2.282744 2.881984 -0.455842
