program: Gaussian 09
title: 000092418
version: EM64L-G09RevD.01
frameworkgroup: C1[X(C17H13ClN2O4)]
method: RPBEPBE
basis: SDD
operation: Freq
keyword: #p
keyword: freq=noraman
keyword: PBEPBE/SDD
title: #p freq=noraman PBEPBE/SDD
converged: YES YES NO NO
title: Mulliken charges:
elementType: Cl O O O O N N C C C C C C C C C C C C C C C C C H H H H H H H H H H H H H
charge: -0.042690 -0.266043 -0.288954 -0.423005 -0.192658 -0.060970 0.002600 -0.067499 0.374406 0.325343 0.119075 0.093210 -0.362996 -0.340894 -0.383687 -0.317146 0.194160 -0.712593 -0.323315 -0.291222 -0.424869 -0.195971 -0.104278 0.170303 0.245133 0.258462 0.260403 0.261803 0.312541 0.251330 0.244741 0.223306 0.259862 0.286948 0.269606 0.261922 0.383637
chargesum: 0.00000
title: Mulliken charges with hydrogens summed into heavy atoms:
elementType: Cl O O O O N N C C C C C C C C C C C C C C C C C
charge: -0.042690 -0.266043 -0.288954 -0.039368 -0.192658 -0.060970 0.002600 0.177635 0.374406 0.325343 0.119075 0.093210 -0.104535 -0.080491 -0.121884 -0.004604 0.194160 0.006785 -0.063453 -0.004274 -0.155264 0.065951 -0.104278 0.170303
polarizability: 4.09457424e+02 4.09363158e+01 2.40758923e+02 -7.85765769e+00 1.46792891e+01 1.07452875e+02
1716.lowfreq: -7.1884 -4.9838 0.0011 0.0015 0.0018 1.2274 13.3828 22.2880 28.4548
frequency: 13.2890 22.1505 28.4500 38.2325 46.4837 60.5717 77.0941 111.0981 144.0713 173.5530 176.8854 191.3075 204.1588 220.6657 241.3615 257.8827 268.9613 316.0826 346.8946 355.1544 375.0748 395.8248 414.0361 422.3216 438.7901 486.9516 487.7506 515.4008 526.5200 552.7407 555.9403 592.4786 602.0100 616.6352 624.5543 640.7732 664.2690 695.0805 709.4491 717.1155 751.1618 775.9105 777.0263 794.3984 819.8530 828.4120 837.9285 839.7824 884.8679 894.1344 905.2620 922.6267 954.4750 964.4063 967.1349 969.3581 1000.9683 1019.8783 1033.2846 1052.6631 1086.0146 1111.7505 1118.2956 1136.2833 1149.3366 1174.9232 1184.9723 1204.5001 1226.6232 1239.5984 1259.2517 1281.4881 1299.1819 1320.3626 1335.6111 1345.2507 1362.4591 1378.9921 1390.3440 1404.4509 1422.7094 1428.4568 1462.1396 1467.5802 1473.8165 1483.3775 1520.9418 1545.1420 1590.8733 1603.9705 1614.1843 1683.1323 3004.2276 3019.0316 3107.6293 3118.1780 3154.4938 3156.8578 3158.6116 3160.8838 3178.9231 3181.0180 3182.8550 3208.5460 3507.5548
redmass: 6.4014 6.3931 9.2002 8.3457 5.7575 4.9426 7.7865 5.4259 6.5641 4.5924 7.8436 5.3485 6.9622 1.1324 4.0453 6.0519 5.1641 5.2488 8.7727 7.5059 7.3659 5.6916 4.0281 3.3016 5.3235 4.4377 4.4766 2.6430 7.1710 4.1710 6.4354 7.3985 3.5471 2.7394 2.7731 5.0921 4.0994 7.0269 3.7834 4.2986 4.7303 3.1582 3.3636 5.1292 1.2670 1.6064 1.6058 6.8302 1.5102 6.9233 1.4498 3.1340 1.3357 1.3329 4.9383 1.3727 2.8085 2.6548 2.3969 1.9805 1.9320 1.2999 1.7371 2.2251 2.1161 2.5179 1.4984 3.0322 2.0940 1.5679 2.2616 2.7715 1.3782 1.2816 2.9692 1.5831 3.7146 6.1210 1.2302 5.8070 3.6386 4.0246 1.0481 3.9198 1.0540 2.4709 8.2310 8.3750 8.0500 7.3494 6.3872 8.8597 1.0348 1.0853 1.1001 1.1016 1.0928 1.0906 1.0884 1.0885 1.0971 1.0976 1.0942 1.0942 1.0641
irintensity: 0.3285 0.2684 1.6440 0.3561 0.3897 0.3034 0.0595 0.1701 0.4546 2.1306 0.0502 2.5983 0.5076 0.1269 0.8037 1.9558 0.3169 1.5604 4.0976 1.3278 0.1612 5.0516 8.4816 2.4979 14.6691 1.2514 10.0979 20.0415 3.3088 14.0171 3.3732 19.2091 28.9149 41.4561 93.6155 9.8029 1.0015 38.0109 13.5744 18.2901 19.2173 1.6502 7.5857 3.3138 1.9422 20.4401 116.4582 3.7227 0.8125 70.0511 36.9638 46.6544 0.9227 0.7942 18.1148 4.8603 36.9983 250.0678 41.7390 21.3625 63.8660 28.6468 9.6280 0.6112 24.8139 35.0520 202.5108 417.2203 45.3027 2.0314 167.4862 58.2115 15.6835 1.4796 184.4924 20.4438 81.6813 4.3536 30.3281 54.1696 5.6157 47.5367 13.9733 20.4668 13.3855 417.2532 268.3161 1.7107 6.0672 29.5897 41.0403 175.6064 14.5696 14.9875 15.5764 12.7805 4.0308 7.4564 1.0493 3.4448 2.7279 3.6820 2.1771 11.5620 24.5939
temp: 298.150 k
press: 1.00000 atm
elementType: 17 8 8 8 8 7 7 6 6 6 6 6 6 6 6 6 6 6 6 6 6 6 6 6 1 1 1 1 1 1 1 1 1 1 1 1 1
symmnumber: 1
zpe: 698418.3 jmol-1
zpe.correction: 0.266013 hartree
zpe.thermalcorrener: 0.287086 hartree
zpe.thermalcorrenthalpy: 0.288031 hartree
zpe.thermalcorrgfe: 0.212283 hartree
zpe.sumelectzpe: -1524.361753 hartree
zpe.sumelectthermal: -1524.340680 hartree
zpe.sumelectthermalent: -1524.339736 hartree
zpe.sumelectthermalfe: -1524.415484 hartree
dipole: 2.5966 -2.6322 -1.5817
dipole: 4.0215
quadrupole: -153.3266 -129.0649 -151.0968
quadrupole: -7.0907 -9.6995 -0.4136
quadrupole: -8.8305 15.4312 -6.6007 -7.0907 -9.6995 -0.4136
hfenergy: -1524.6277669 hartree
pointgroup: C01 [X(C17H13Cl1N2O4)]
dipole: -1.037936 -1.1728906 0.2243967 debye
polarizability: 400.1095633|-34.3553127|229.8992768|-50.9112427|46.3107788|127.6603817 unknown
InChI: InChI=1S/C17H13ClN2O4/c1-10(17(21)22)23-12-3-5-13(6-4-12)24-16-9-19-15-8-11(18)2-7-14(15)20-16/h2-10,21H,1H3
charge 0 multiplicity 1
37 atoms
Cl 7.487304 -2.015213 -1.437319
O  -4.641613 0.206189 1.030958
O  0.717853 1.91792 0.742421
O  -4.542961 -2.612024 -1.17623
O  -5.378678 -0.51384 -1.747303
N  1.995929 0.029236 -0.003431
N  4.283695 1.778308 0.157305
C  -5.093139 -1.137154 0.650967
C  -3.270075 0.511803 0.902229
C  -0.585965 1.337926 0.762522
C  3.271221 -0.427263 -0.329779
C  4.421092 0.447232 -0.251366
C  -2.918173 1.832114 1.276989
C  -2.275577 -0.389877 0.456766
C  -1.579066 2.24403 1.206419
C  -0.923259 0.020797 0.384801
C  1.904002 1.306296 0.382475
C  -6.549184 -1.244485 1.124493
C  3.452951 -1.778825 -0.748775
C  5.716123 -0.040029 -0.591637
C  3.051212 2.189587 0.465528
C  4.728153 -2.249973 -1.080601
C  5.843764 -1.367784 -0.996375
C  -5.025265 -1.326972 -0.875049
H  -4.463468 -1.908473 1.132988
H  -3.704138 2.513687 1.613686
H  -2.521913 -1.412621 0.155706
H  -1.285129 3.259225 1.487688
H  -0.14757 -0.664022 0.044153
H  -7.160778 -0.464253 0.642144
H  -6.589848 -1.105923 2.217399
H  -6.964446 -2.236392 0.875175
H  2.577796 -2.432676 -0.803565
H  6.569093 0.639814 -0.525171
H  2.909951 3.225425 0.788986
H  4.876871 -3.28456 -1.402817
H  -4.557665 -2.753329 -2.162278
