program: Gaussian 09
title: 000092385
version: EM64L-G09RevD.01
frameworkgroup: C1[X(C12H3Cl7O)]
method: RPBEPBE
basis: SDD
operation: Freq
keyword: #p
keyword: freq=noraman
keyword: PBEPBE/SDD
title: #p freq=noraman PBEPBE/SDD
converged: YES YES NO NO
title: Mulliken charges:
elementType: Cl Cl Cl Cl Cl Cl Cl O C C C C C C C C C C C C H H H
charge: 0.059343 0.054791 0.052778 0.014649 0.057544 0.051147 0.018335 -0.262693 0.548779 0.491356 -0.379649 -0.339447 -0.311892 -0.344372 -0.009571 -0.066862 -0.126071 -0.035492 -0.192786 -0.136193 0.304068 0.283021 0.269217
chargesum: 0.00000
title: Mulliken charges with hydrogens summed into heavy atoms:
elementType: Cl Cl Cl Cl Cl Cl Cl O C C C C C C C C C C C C
charge: 0.059343 0.054791 0.052778 0.014649 0.057544 0.051147 0.018335 -0.262693 0.548779 0.491356 -0.379649 -0.035378 -0.311892 -0.061350 -0.009571 -0.066862 -0.126071 -0.035492 0.076431 -0.136193
polarizability: 3.06650234e+02 1.17502241e+01 1.99350518e+02 5.00224471e+00 -7.51896093e+00 1.27079356e+02
1716.lowfreq: -2.8689 0.0025 0.0029 0.0037 2.2031 4.7383 11.4055 19.3693 32.6228
frequency: 11.1403 19.2397 32.6177 65.0785 77.0694 78.3789 108.4495 129.7176 148.4631 193.2836 196.5526 201.6912 207.5503 215.3537 232.4687 239.7266 262.6471 302.9985 319.0176 329.3210 335.8894 339.9982 406.9717 443.4721 470.3905 506.7117 520.5286 524.2302 536.7126 561.5292 597.5924 606.4861 678.0530 690.9944 716.5474 735.3408 742.1087 785.6595 809.8685 844.8497 858.4266 940.2117 944.4546 1041.3513 1050.3200 1140.5828 1161.3294 1163.0296 1211.6361 1252.6765 1327.6413 1349.9023 1358.7722 1361.2334 1405.7207 1427.6818 1548.2675 1561.9109 1566.0836 1581.4081 3163.6151 3179.3080 3183.9181
redmass: 15.3700 18.0058 21.3057 25.4148 31.5572 30.4249 8.8092 19.9583 12.4855 29.2617 27.3653 31.6944 33.8635 17.7986 7.3375 12.4249 7.2485 10.2200 21.8416 27.4197 23.5236 13.1441 10.3417 14.4684 9.4114 4.5784 6.4660 4.9835 11.5492 6.1099 9.4496 11.3115 7.9048 10.5727 6.3753 6.2463 8.6430 11.1531 1.4219 7.9253 1.5322 3.7508 1.7549 9.0974 9.0162 1.6389 1.6779 1.9381 3.5558 5.4456 9.6704 8.7698 6.7014 8.2388 3.8619 2.8807 9.6549 8.8238 8.1638 8.0605 1.0893 1.0924 1.0973
irintensity: 0.9549 0.1319 0.0904 0.3508 0.0246 0.0673 0.5205 0.0425 0.5729 0.1546 0.0181 0.0050 0.0206 0.1528 4.6952 3.3552 1.6818 0.8012 0.1795 0.4013 0.9969 3.7175 1.8072 13.3486 7.5270 1.5560 4.4728 4.2491 6.5373 7.5061 8.7539 14.6764 18.4182 30.6829 1.3837 6.7764 40.6580 45.6355 50.7156 33.8856 11.8094 72.0108 32.4657 17.3955 130.3161 2.7269 63.5185 21.3951 31.8982 178.9856 154.9713 28.1678 29.6536 21.4099 381.7245 233.7071 24.9904 0.5073 138.5527 9.6273 1.8073 1.2414 0.2641
temp: 298.150 k
press: 1.00000 atm
elementType: 17 17 17 17 17 17 17 8 6 6 6 6 6 6 6 6 6 6 6 6 1 1 1
symmnumber: 1
zpe: 299091.4 jmol-1
zpe.correction: 0.113918 hartree
zpe.thermalcorrener: 0.133347 hartree
zpe.thermalcorrenthalpy: 0.134291 hartree
zpe.thermalcorrgfe: 0.061583 hartree
zpe.sumelectzpe: -3753.271778 hartree
zpe.sumelectthermal: -3753.252348 hartree
zpe.sumelectthermalent: -3753.251404 hartree
zpe.sumelectthermalfe: -3753.324113 hartree
dipole: 0.6293 1.6044 -1.6945
dipole: 2.4169
quadrupole: -174.8647 -165.0472 -158.1446
quadrupole: 2.6998 -2.3471 -3.0844
quadrupole: -8.8458 0.9716 7.8742 2.6998 -2.3471 -3.0844
hfenergy: -3753.3856956 hartree
pointgroup: C01 [X(C12H3Cl7O1)]
dipole: -0.2499511 -0.0286818 0.916995 debye
dipolederiv: -0.0118492 -0.0537753 -0.0300872 -0.0623057 -0.4824246 -0.2762864 -0.0237176 -0.2756263 -0.1367626 -0.0280157 -0.0035889 0.0971339 -0.0052927 0.007743 0.0586278 0.0932555 0.0412986 -0.5876065 -0.4968262 0.2645048 0.1391006 0.2933359 -0.1659244 -0.0909476 0.1458341 -0.0913806 -0.0382667 -0.0772407 0.0116117 0.0056736 -0.1028635 -0.5537688 -0.2854102 -0.0480939 -0.3020058 -0.1752524 -0.6017653 -0.2262391 -0.1375256 -0.2441404 -0.0902328 -0.0643402 -0.1711035 -0.0733695 -0.0271021 -0.4608175 0.1172995 -0.2655564 0.1642276 -0.0321301 0.0921164 -0.3258476 0.090422 -0.1971054 -0.644132 0.076661 0.285595 0.1210033 -0.0301154 -0.0525666 0.3292198 -0.0346101 -0.212464 -2.5560552 -0.1302404 0.0393581 0.1325651 -0.2346166 -0.0693776 -0.0865834 -0.0609906 -0.2327095 1.8786268 0.1913309 0.0648575 0.441827 0.120185 -0.0356178 0.5975829 -0.0180816 0.0803599 1.6536487 -0.0354083 -0.1129583 -0.5763501 0.0863798 0.028465 -0.545016 -0.0220608 -0.0048769 -0.5109812 0.047773 0.0421235 0.1718357 0.6604896 0.4220929 0.1150535 0.4441983 0.1521517 -0.4026497 0.0101742 0.0203969 -0.2852442 -0.2796092 -0.0863186 -0.1851975 -0.0996159 -0.1602786 -0.3094701 0.02478 -0.1740046 0.0497749 -0.0548946 -0.0604191 -0.2214201 -0.0303964 0.8653796 -0.2449294 -0.0387882 -0.0660015 0.0275216 -0.125585 0.0002638 0.1904059 -0.0138709 -0.0211861 0.7068443 -0.4033024 -0.2158672 -0.4901036 0.1934171 0.088726 -0.2565029 0.0884123 0.0536901 0.1534954 -0.1011824 -0.0456836 0.0783694 0.8347173 0.4562383 0.0455872 0.4760867 0.234198 0.6179761 0.4492898 0.2691869 0.442562 -0.1793093 -0.0386172 0.2837928 -0.0386412 -0.0717483 0.5303901 -0.1788995 0.530774 -0.2306624 0.0524624 -0.1520035 0.6389807 -0.1418115 0.1067361 -0.1315809 -0.0067661 0.1462223 0.0079461 -0.0716532 -0.0441038 0.0214331 -0.0101672 -0.0150155 0.7633675 -0.1070969 -0.5742078 -0.134783 -0.044007 0.1227674 -0.5486804 0.0819598 0.2050127 0.0758662 0.0297086 0.0069937 0.1009783 0.0937663 -0.0330068 0.004405 -0.0390605 0.1225308 0.0277884 0.0506913 -0.0392567 0.0878889 0.138244 0.0047555 -0.0758372 0.0071413 0.0615073 0.0683098 0.0114627 0.013733 0.0119099 0.1568665 0.0149622 0.0224499 0.0221698 -0.0011917 unknown
polarizability: 306.6058222|-12.3352353|155.4253141|-4.3881058|36.0463007|171.0489719 unknown
InChI: InChI=1S/C12H3Cl7O/c13-4-1-2-6(10(17)8(4)15)20-7-3-5(14)9(16)12(19)11(7)18/h1-3H
charge 0 multiplicity 1
23 atoms
Cl 2.089247 -2.658052 -1.664077
Cl -2.182871 -0.034735 -2.789986
Cl 5.007939 -1.468633 -0.915141
Cl 2.516336 2.923233 1.474015
Cl 5.23905 1.326916 0.678992
Cl -5.090413 0.537667 -1.460319
Cl -5.442996 0.236537 1.761753
O  -0.139941 -0.938669 -0.844722
C  1.081977 -0.391719 -0.419945
C  -1.344524 -0.58047 -0.201459
C  2.253665 -1.100974 -0.784803
C  1.177587 0.836078 0.266194
C  -2.435378 -0.198301 -1.0186
C  -1.50804 -0.717902 1.193488
C  3.521056 -0.570837 -0.452615
C  2.444626 1.346656 0.595547
C  3.627808 0.658942 0.2468
C  -3.699944 0.052707 -0.430716
C  -2.761118 -0.459558 1.77903
C  -3.850457 -0.077507 0.969736
H  0.278041 1.397495 0.529059
H  -0.663782 -1.037468 1.810911
H  -2.901869 -0.564705 2.857755
