program: Gaussian 09
title: 000092367
version: EM64L-G09RevD.01
frameworkgroup: C1[X(C4H11N3)]
method: RPBEPBE
basis: SDD
operation: Freq
keyword: #pfreq=noraman
keyword: PBEPBE/SDD
title: #p freq=noraman PBEPBE/SDD
converged: YES YES NO NO
title: Mulliken charges:
elementType: N N N C C C C H H H H H H H H H H H
charge: -0.292539 -0.145260 -0.006540 -0.334650 -0.641334 -0.382109 -0.661556 0.211358 0.234393 0.232000 0.209623 0.213018 0.210253 0.211181 0.290490 0.206498 0.226681 0.218492
chargesum: 0.00000
title: Mulliken charges with hydrogens summed into heavy atoms:
elementType: N N N C C C C
charge: -0.002048 -0.145260 -0.006540 0.111101 0.013307 0.039324 -0.009884
polarizability: 1.08836091e+02 -1.65694716e+00 5.24973637e+01 1.18115533e+00 -9.98394002e-01 5.65454380e+01
1716.lowfreq: -15.4787 -6.4759 -3.2692 -0.0007 -0.0006 -0.0003 36.7755 48.0372 116.7963
frequency: 36.5051 48.0290 116.7846 166.8260 218.1108 222.2605 272.6568 359.3663 432.0566 483.6417 543.1155 609.4486 773.0804 804.3815 863.0469 923.4700 1011.3700 1041.4430 1081.5316 1083.9470 1136.9370 1175.8987 1204.0602 1249.2295 1302.2985 1324.8922 1349.0406 1379.8932 1381.7020 1399.2388 1449.8314 1459.2003 1463.5577 1467.1598 1474.0512 1480.8711 1485.0144 2959.1772 2981.1916 2985.2402 3003.7045 3022.5886 3065.5892 3082.3059 3084.2756 3090.9637 3097.0695 3401.4956
redmass: 2.8705 2.1061 4.1066 1.4932 2.6519 1.0987 1.5088 3.4136 3.0978 2.8691 3.1759 1.3996 1.1897 1.1585 2.2818 1.8352 2.3404 3.8051 1.9627 1.8715 1.6950 2.7028 2.6623 1.2010 1.2465 1.3806 1.2828 1.2751 1.2223 3.1069 1.1910 1.0796 1.0823 1.0944 1.3249 1.0724 1.0693 1.0574 1.0353 1.0351 1.0634 1.1034 1.0996 1.0987 1.0995 1.1011 1.1022 1.0748
irintensity: 1.1372 0.5051 3.0248 2.1921 13.9200 1.0157 3.1996 5.7140 2.1111 28.8606 5.6680 126.0667 10.5787 2.0205 9.5917 6.4003 12.5236 3.4432 11.3818 12.7060 1.3195 76.2377 112.0214 16.5646 18.0953 14.3444 11.6861 25.0230 10.2085 54.7222 37.5482 22.9183 16.4991 27.7012 38.5183 19.7762 14.0913 63.6706 27.5004 38.6929 47.4018 20.5072 3.2125 52.3146 49.0548 42.2508 44.0850 0.1746
temp: 298.150 k
press: 1.00000 atm
elementType: 7 7 7 6 6 6 6 1 1 1 1 1 1 1 1 1 1 1
symmnumber: 1
zpe: 407014.7 jmol-1
zpe.correction: 0.155024 hartree
zpe.thermalcorrener: 0.164166 hartree
zpe.thermalcorrenthalpy: 0.165110 hartree
zpe.thermalcorrgfe: 0.120178 hartree
zpe.sumelectzpe: -322.630645 hartree
zpe.sumelectthermal: -322.621503 hartree
zpe.sumelectthermalent: -322.620559 hartree
zpe.sumelectthermalfe: -322.665491 hartree
dipole: 1.5788 0.4453 0.0452
dipole: 1.6410
quadrupole: -36.1830 -45.0638 -44.0761
quadrupole: -0.7882 2.5223 -0.2087
quadrupole: 5.5913 -3.2895 -2.3017 -0.7882 2.5223 -0.2087
hfenergy: -322.7856687 hartree
pointgroup: C01 [X(C4H11N3)]
dipole: 0.6146225 -0.1396227 -0.1398594 debye
dipolederiv: -1.2789005 0.0866262 -0.0007145 -0.5976476 -0.2810942 -0.2848046 0.3462024 -0.2958316 -0.2533277 -0.9598998 -0.066674 0.0792898 0.3932379 -0.2268088 -0.0694451 -0.420011 -0.0747685 -0.2427153 1.4543959 0.0550044 -0.0485958 0.3625795 -0.1251648 0.0828008 -0.2441461 0.0698998 -0.074069 0.7193539 -0.1533913 -0.0137781 -0.2506128 0.3483795 0.1050541 0.1830886 0.1045335 0.2504545 -0.0802229 0.0373916 0.0163821 0.1166757 -0.0375356 -0.0964809 0.0058515 -0.1211018 -0.0271505 0.4020871 0.0110662 -0.0526895 0.0961101 0.2468442 -0.0137441 -0.0849653 0.0222122 0.2185406 -0.0120303 -0.0264677 -0.0500343 -0.0885637 0.0457823 -0.0361986 0.0423555 -0.0460324 -0.0143462 -0.1331088 -0.0742598 -0.0359063 -0.0957787 -0.0830032 -0.0707647 -0.0091442 -0.0409956 0.0845182 0.0706041 -0.003322 0.0692193 0.0593433 0.040057 0.075605 -0.0093895 0.0538736 -0.0855721 0.0011118 -0.1357619 -0.0237855 -0.0983002 -0.0363304 -0.0458535 0.0026708 -0.0282006 0.0708196 0.1070501 -0.001473 0.0227531 -0.0308931 0.0097373 0.1191634 0.0404371 0.0709578 -0.1208364 -0.1672579 0.1197854 -0.0444762 0.1614034 0.0415068 0.005817 -0.039755 0.0196526 0.0653913 -0.0113582 0.0237303 -0.0634737 -0.0903474 -0.0570417 0.1484382 0.0346844 0.1188777 -0.0813133 -0.1052826 0.0645579 0.070266 0.0499181 -0.0591989 -0.1153113 0.1086259 -0.0720464 0.0183241 0.034317 0.032929 -0.0075094 0.0050543 0.194793 0.1487861 0.0337632 0.1920324 0.1638531 -0.1906208 -0.0984173 0.0612875 -0.1226945 0.0655563 0.0162515 0.0588113 0.0253456 0.0515458 0.1114495 0.0169304 -0.0309546 0.0623789 -0.0224575 0.1317058 -0.0555036 0.0911794 -0.0482484 0.0383125 0.1117458 0.05272 0.0681368 -0.0640212 -0.1010192 0.0064242 -0.0895876 0.0241318 unknown
polarizability: 108.8716045|0.6787583|55.0189922|-1.3090908|-2.2055043|53.988296 unknown
InChI: InChI=1S/C4H11N3/c1-3-5-7-6-4-2/h5H,3-4H2,1-2H3
charge 0 multiplicity 1
18 atoms
N  1.144029 0.811488 0.132601
N  -1.08781 0.78133 0.093424
N  -0.009847 0.224036 0.578507
C  2.418975 0.151807 0.425297
C  2.880827 -0.834106 -0.673069
C  -2.323411 0.145753 0.628628
C  -3.140084 -0.472449 -0.524342
H  3.186696 0.933039 0.582183
H  2.287898 -0.381006 1.382982
H  2.133423 -1.635203 -0.810015
H  3.017965 -0.31942 -1.641859
H  3.844592 -1.298773 -0.393269
H  -2.083397 -0.619135 1.395792
H  -2.920018 0.946375 1.108882
H  1.065257 1.549354 -0.583355
H  -4.11099 -0.84774 -0.151709
H  -3.33507 0.281697 -1.307449
H  -2.594436 -1.314146 -0.986728
