program: Gaussian 09
title: 000092365
version: EM64L-G09RevD.01
frameworkgroup: C1[X(C10H7N3O)]
method: RPBEPBE
basis: SDD
operation: Freq
keyword: #p
keyword: freq=noraman
keyword: PBEPBE/SDD
title: #p freq=noraman PBEPBE/SDD
converged: YES YES NO NO
title: Mulliken charges:
elementType: O N N N C C C C C C C C C C H H H H H H H
charge: -0.229932 -0.014237 0.012243 0.014464 0.335397 -0.336905 -0.350319 -0.224514 -0.218100 -0.227708 0.040042 -0.171220 -0.266791 -0.111853 0.252498 0.264629 0.237273 0.235224 0.237720 0.261052 0.261035
chargesum: 0.00000
title: Mulliken charges with hydrogens summed into heavy atoms:
elementType: O N N N C C C C C C C C C C
charge: -0.229932 -0.014237 0.012243 0.014464 0.335397 -0.084407 -0.085690 0.012759 0.017125 0.010012 0.040042 -0.171220 0.255297 -0.111853
polarizability: 2.22924184e+02 -4.50793893e+00 1.33547966e+02 2.02218604e-02 1.62583491e-02 5.41580399e+01
1716.lowfreq: 0.0001 0.0004 0.0007 4.0018 9.0118 10.6625 23.4522 37.5267 63.2865
frequency: 23.3489 37.3577 63.2572 84.9892 123.4483 134.9698 156.2524 260.4255 283.0489 305.4642 307.1373 357.3219 400.6011 410.2585 448.0081 486.5405 546.0424 614.9779 668.0479 671.3687 696.0928 761.8014 785.5152 856.5148 888.0441 941.3233 950.5076 983.4058 986.9568 988.8472 988.8556 1006.3087 1017.4410 1047.5141 1091.0978 1177.2924 1187.8206 1195.2103 1298.9438 1325.6028 1342.2246 1385.5995 1433.5179 1452.6449 1485.0067 1501.4950 1587.2725 1611.0930 2177.3217 2219.8007 3003.6687 3065.9114 3133.6798 3140.7077 3151.6732 3163.5277 3173.9748
redmass: 5.1824 3.8858 8.7113 4.5783 9.0063 5.3913 8.7942 8.5151 5.7971 7.9150 9.3192 3.9676 2.8201 7.9283 9.7320 3.7868 10.6509 6.4548 7.2955 6.2987 1.7266 10.0432 1.9391 1.2511 10.7905 1.4264 5.3814 7.3151 1.6520 1.4874 4.8831 1.3331 4.1310 2.5968 1.6033 1.0545 1.0606 1.1204 3.4076 1.4466 1.3497 7.4232 2.5043 1.0753 2.4782 6.4803 6.1614 5.9474 12.6582 12.4649 1.0555 1.1063 1.0854 1.0886 1.0929 1.0963 1.1012
irintensity: 5.8544 3.0858 0.4069 4.4374 0.7726 1.7059 9.3991 0.9540 4.3100 6.0866 2.3765 0.0956 0.0005 16.5913 0.8694 8.5106 0.9028 0.0685 9.5570 11.9937 58.6528 31.1693 45.4648 0.0094 139.2316 4.2562 22.3881 285.4933 0.5261 0.3475 2.7950 0.1729 3.6863 3.7724 4.9413 0.3199 0.1339 3.7601 71.0790 6.7724 20.3479 0.6766 15.3059 17.4729 6.6451 1.4265 0.3740 3.3073 6.4481 1.2226 36.2709 6.9849 0.6259 2.6209 12.8011 16.1816 19.3484
temp: 298.150 k
press: 1.00000 atm
elementType: 8 7 7 7 6 6 6 6 6 6 6 6 6 6 1 1 1 1 1 1 1
symmnumber: 1
zpe: 386316.5 jmol-1
zpe.correction: 0.147140 hartree
zpe.thermalcorrener: 0.159986 hartree
zpe.thermalcorrenthalpy: 0.160931 hartree
zpe.thermalcorrgfe: 0.105578 hartree
zpe.sumelectzpe: -623.667439 hartree
zpe.sumelectthermal: -623.654593 hartree
zpe.sumelectthermalent: -623.653649 hartree
zpe.sumelectthermalfe: -623.709001 hartree
dipole: 4.9995 -4.5928 -0.0016
dipole: 6.7889
quadrupole: -89.5325 -80.9709 -81.5806
quadrupole: 9.7914 0.0218 -0.0097
quadrupole: -5.5045 3.0571 2.4474 9.7914 0.0218 -0.0097
hfenergy: -623.8145792 hartree
pointgroup: C01 [X(C10H7N3O1)]
dipole: -2.0522607 -1.7094684 0.0008095 debye
dipolederiv: -1.9360927 0.449364 0.000918 -0.3814503 -0.1037779 0.0001345 0.0017046 -0.0003973 -0.1911263 0.8823251 -0.4432769 -0.0008503 0.7284641 -0.2831163 -0.0001863 -0.001672 0.0003499 -0.1468449 -0.1563981 0.0146652 -0.0000984 0.1005918 -0.1579804 -0.0003053 -0.0000896 -0.0001202 -0.2287571 -0.1606997 0.0369079 -0.0003493 0.0283661 -0.1781344 -0.0001427 -0.0001335 -0.0000737 -0.2033497 -0.1359315 -0.0046401 0.0000057 -0.0708248 -0.0862712 -0.0000196 -0.0000669 0.0002089 -0.0084405 0.0132768 0.1095995 0.000157 -0.0994144 0.0183987 0.0000785 -0.0002844 0.0000338 -0.1299181 0.0108232 -0.1022562 0.0000601 0.0930045 -0.0141079 0.0000669 -0.0000281 0.0000068 -0.1299694 -0.0017315 -0.1598188 -0.0000024 -0.230208 0.0019831 0.0000161 0.0000265 -0.0000104 -0.1456391 -0.2061701 0.0834588 0.0000766 0.1652743 0.1361577 0.0001695 0.0000755 0.0001621 -0.1412419 0.1003086 0.0327378 0.0001335 -0.0253877 -0.0119131 0.0000697 0.0000497 0.000068 -0.1408722 0.6553664 0.2461619 0.0003129 0.3565941 0.2261744 -0.0002559 0.0012122 -0.0006848 0.1628448 -0.120162 -0.028752 0.0001038 -0.2137775 -0.0486717 0.0002341 0.0001112 0.0004093 0.1047393 1.1165239 -0.3050884 -0.0005954 -0.7447993 0.5795307 0.0005376 -0.0013162 0.0004305 0.4374867 -0.1407572 0.0499714 0.0003914 0.0224684 -0.0768145 0.0000909 0.0003626 -0.0000587 -0.0232293 0.1030935 -0.0541958 -0.0000836 -0.0534893 -0.0321426 -0.0000863 -0.0000861 -0.0000967 0.1557948 0.0590133 0.0919726 -0.0000102 0.0674408 0.0364171 -0.000062 0.000025 -0.0000245 0.1521522 -0.0190898 0.0837847 0.0000009 0.1099498 -0.0143855 -0.000042 0.0000193 -0.0000183 0.1610578 0.0506661 -0.0556221 -0.0000399 -0.0798797 -0.0898038 -0.0001278 -0.0000383 -0.0001503 0.1578017 -0.1100299 -0.0437159 -0.0001024 -0.0471078 0.085573 -0.0000472 -0.0001388 -0.0000512 0.1611239 -0.0022197 -0.0007341 -0.0213027 0.1370577 0.0065481 -0.0510066 0.0228914 -0.094086 -0.0018967 -0.0021147 -0.0005237 0.0212747 0.1371271 0.0063363 0.050884 -0.0226241 0.0941027 -0.0017161 unknown
polarizability: 223.1506884|0.1585115|133.321453|-0.0479102|0.0118193|54.1580492 unknown
InChI: InChI=1S/C10H7N3O/c11-6-7-14-13-10(8-12)9-4-2-1-3-5-9/h1-5H,7H2
charge 0 multiplicity 1
21 atoms
O  2.201243 -0.105185 0.001076
N  0.841548 -0.608952 0.002297
N  0.699036 2.9281 0.000612
N  5.616605 -0.458146 -0.004079
C  -1.485734 0.070299 0.002103
C  -2.447607 1.116968 0.002148
C  -1.927516 -1.283193 0.001288
C  -3.826139 0.81511 0.001555
C  -3.303622 -1.576227 0.000683
C  -4.259469 -0.529735 0.000816
C  -0.037047 0.391165 0.002858
C  0.373681 1.77839 0.001775
C  3.091549 -1.294828 -0.000975
C  4.479448 -0.813779 -0.00222
H  -2.119693 2.162518 0.002711
H  -1.186474 -2.088197 0.001184
H  -4.558556 1.629069 0.001647
H  -3.636488 -2.619701 0.000084
H  -5.329677 -0.762973 0.000321
H  2.894375 -1.90426 -0.902271
H  2.896535 -1.905741 0.899786
