program: Gaussian 09
title: 000092559
version: EM64L-G09RevD.01
frameworkgroup: C1[X(C19H20N4O11S3)]
method: RPBEPBE
basis: SDD
operation: Freq
keyword: #p
keyword: freq=noraman
keyword: PBEPBE/SDD
title: #p freq=noraman PBEPBE/SDD
converged: YES YES NO NO
title: Mulliken charges:
elementType: S S S O O O O O O O O O O O N N N N C C C C C C C C C C C C C C C C C C C H H H H H H H H H H H H H H H H H H H H
charge: 0.880524 0.991817 1.187603 -0.535492 -0.539905 -0.385376 -0.192957 -0.214458 -0.568772 -0.504349 -0.502712 -0.542795 -0.478926 -0.448989 -0.279988 -0.030129 -0.059147 -0.023562 -0.434341 -0.556297 -0.053091 0.243422 0.183502 0.448414 -0.281705 -0.223058 0.029329 -0.262896 0.225760 -0.760692 -0.310281 -0.361317 -0.324315 -0.081874 -0.205040 -0.224886 -0.536934 0.299085 0.284984 0.290118 0.328662 0.269762 0.274512 0.295441 0.260017 0.241589 0.256223 0.264316 0.295634 0.310121 0.283395 0.283310 0.232594 0.231168 0.261647 0.381833 0.389503
chargesum: 0.00000
title: Mulliken charges with hydrogens summed into heavy atoms:
elementType: S S S O O O O O O O O O O O N N N N C C C C C C C C C C C C C C C C C C C
charge: 0.880524 0.991817 1.187603 -0.535492 -0.539905 -0.385376 -0.192957 -0.214458 -0.186939 -0.504349 -0.502712 -0.153293 -0.478926 -0.448989 -0.279988 -0.030129 -0.059147 -0.023562 -0.135256 0.018805 -0.053091 0.243422 0.183502 0.448414 0.046957 0.321216 0.029329 0.032545 0.225760 -0.002863 -0.045965 -0.065683 -0.014194 -0.081874 0.078355 0.058425 0.188475
polarizability: 5.44734059e+02 -5.54564452e+01 4.72670240e+02 -1.82792448e+01 5.09872810e+00 2.98331715e+02
1716.lowfreq: -3.5304 0.0026 0.0028 0.0029 0.8362 2.9295 5.0132 7.7422 14.0955
frequency: 3.4098 7.5277 14.0420 16.5132 19.6687 25.1311 28.8098 36.0529 40.9614 55.1622 61.7613 68.2110 71.0865 83.4672 91.3888 94.6689 101.4370 112.1488 117.0502 133.5255 135.9562 142.7058 153.8144 154.4699 159.6446 173.4982 176.6915 191.3624 198.5725 212.6334 216.8246 231.1484 234.0450 242.0091 254.9096 259.5686 275.0343 280.7292 291.3152 296.4012 306.6984 314.0615 325.5543 331.6913 342.1631 351.8329 354.6201 372.4091 376.0552 388.1915 394.0799 409.7772 417.4642 422.6604 461.6284 468.9907 492.5166 510.5015 520.6860 530.8117 543.5106 553.0439 558.9124 568.5633 586.6689 602.3510 608.7317 618.0200 620.3119 651.6845 682.2045 706.9299 736.1019 758.3946 761.4847 789.0741 792.1401 807.4600 829.0303 833.6512 845.8890 851.0332 863.1993 863.6907 909.7063 913.1975 915.3069 936.9120 947.6183 966.2873 968.6484 969.4062 983.1933 986.6219 989.6109 993.8028 999.8993 1011.4505 1016.3900 1041.7692 1045.8772 1047.0478 1060.4264 1061.2756 1065.0968 1074.0684 1110.0467 1122.0546 1125.8454 1127.3243 1148.6115 1150.4739 1172.5942 1185.1467 1191.2339 1221.7517 1231.7834 1249.9144 1255.2627 1261.6449 1293.1218 1300.0536 1353.5451 1357.8953 1374.1581 1389.6878 1394.2254 1396.3966 1402.4462 1411.9347 1415.9748 1432.6517 1452.0829 1454.7229 1461.9701 1470.9929 1472.8960 1480.0642 1490.3143 1576.6380 1581.1654 1585.9559 1595.6583 1595.8841 1650.0332 2974.9022 2976.2769 2984.2329 3018.5217 3060.6189 3066.5215 3073.5014 3097.1891 3117.4118 3143.7569 3150.2418 3151.4839 3164.1696 3164.5527 3165.2277 3180.8838 3193.9670 3199.0278 3471.4577 3480.0425
redmass: 7.7669 10.4529 8.5690 9.4747 7.4366 7.2363 7.0045 8.1553 9.0909 4.2950 4.5209 5.8093 6.9273 6.5936 4.6615 2.7739 4.9407 4.9120 5.2102 2.5888 7.0921 6.0788 3.0851 4.6683 1.3705 2.4522 2.0149 4.9107 6.2852 5.5595 4.3749 3.3798 2.5710 2.2464 4.8718 4.2453 4.1861 4.0961 4.9660 7.4090 6.7635 7.2293 8.9498 11.7425 7.2851 8.0144 6.1058 7.0446 6.7165 5.7913 6.1643 6.2546 3.1444 8.4243 9.1754 7.9984 3.4988 11.4786 4.3229 5.9965 10.5995 7.1488 6.3545 4.8083 5.7978 6.5898 6.6067 7.0821 6.8652 5.7172 6.8566 8.7815 3.7978 4.3165 3.9449 9.9723 7.6865 1.2370 1.6710 12.8356 6.7987 1.2503 1.6845 7.5564 4.3238 6.0597 3.7363 4.1440 1.5024 16.5257 7.4552 1.3612 2.6960 1.5251 2.7153 8.0076 1.3487 3.9271 1.5684 4.2358 2.0702 1.3248 1.9255 2.0281 1.9199 1.8976 1.2562 3.5076 2.5178 1.4404 1.5663 1.1734 1.5314 1.2052 1.3367 1.1945 2.0058 1.7495 1.7574 1.1692 3.5298 1.2757 1.2294 3.4076 5.7757 8.2456 9.4499 6.1309 1.4678 1.1164 3.3646 1.2690 1.0992 1.0576 1.5325 1.3357 1.0496 2.6447 1.0806 6.7692 6.8076 7.9138 6.5303 6.6292 12.2985 1.0797 1.0328 1.0389 1.0557 1.0967 1.0547 1.1050 1.1104 1.0988 1.1004 1.0908 1.0911 1.0912 1.0914 1.1122 1.0943 1.0954 1.0949 1.0663 1.0661
irintensity: 0.5334 0.2874 0.3574 0.2367 1.8920 1.0648 2.1166 2.0681 1.4928 0.7100 2.1765 2.2466 0.4019 1.2365 1.0190 5.3432 4.0845 1.0965 0.9322 60.7782 0.8937 6.2824 15.7285 9.6875 4.4466 11.9261 35.6424 18.5101 0.0499 2.0656 1.0837 1.6116 1.8100 6.6125 2.6120 14.0356 57.5833 26.5058 50.3220 9.9412 22.7657 27.3876 23.3986 11.1116 23.2816 8.1298 6.7343 34.7019 40.9295 8.8381 8.8470 6.2457 0.3476 2.6140 44.0196 45.7614 3.2603 91.9234 58.2203 26.6815 177.6850 76.6101 56.7119 78.9438 56.8085 23.1469 1.7577 0.3075 40.0513 12.6935 28.9363 39.7525 0.6206 3.9657 5.1532 32.0804 64.3905 0.3525 29.7229 93.1137 6.1458 1.5612 135.4574 62.0701 72.0685 34.6132 3.9109 10.1785 8.9381 87.4992 43.7071 2.4640 29.7585 11.4787 2.5190 110.3969 0.2667 5.6436 13.7001 37.6084 36.7798 46.2765 55.8718 104.9226 24.3635 70.8597 0.0551 70.8608 38.0713 26.7901 31.1015 0.7380 106.6050 30.6522 3.5079 27.2508 106.2423 51.5941 166.2891 1.9739 301.5339 1.9217 1.5447 116.6336 27.0845 1.2767 7.9957 26.1232 32.3861 9.1910 19.2204 33.9707 20.3631 16.6010 166.3747 4.2032 15.7921 220.7377 13.9952 75.3849 6.4461 27.0449 83.1969 144.4546 150.8029 22.5749 66.1299 7.5067 2.8613 7.5534 4.0171 31.0010 1.5742 8.2842 12.4802 13.1131 3.6535 0.6551 5.3864 0.0651 9.0294 4.7091 0.1641 70.6259 45.0661
temp: 298.150 k
press: 1.00000 atm
elementType: 16 16 16 8 8 8 8 8 8 8 8 8 8 8 7 7 7 7 6 6 6 6 6 6 6 6 6 6 6 6 6 6 6 6 6 6 6 1 1 1 1 1 1 1 1 1 1 1 1 1 1 1 1 1 1 1 1
symmnumber: 1
zpe: 1006475.7 jmol-1
zpe.correction: 0.383346 hartree
zpe.thermalcorrener: 0.423693 hartree
zpe.thermalcorrenthalpy: 0.424637 hartree
zpe.thermalcorrgfe: 0.301012 hartree
zpe.sumelectzpe: -2973.300736 hartree
zpe.sumelectthermal: -2973.260389 hartree
zpe.sumelectthermalent: -2973.259445 hartree
zpe.sumelectthermalfe: -2973.383070 hartree
dipole: 2.8032 -10.9997 -0.3366
dipole: 11.3563
quadrupole: -285.2528 -213.1220 -240.8390
quadrupole: -1.1571 -20.4027 22.9616
quadrupole: -38.8482 33.2826 5.5656 -1.1571 -20.4027 22.9616
hfenergy: -2973.6840821 hartree
pointgroup: C01 [X(C19H20N4O11S3)]
dipole: -0.6647814 4.3722146 0.6355534 debye
polarizability: 527.7487431|-66.8631865|482.3291368|28.1446005|21.3613897|305.6581347 unknown
InChI: InChI=1S/C19H20N4O11S3/c1-12-18(19(24)23(22-12)13-3-5-14(6-4-13)36(27,28)29)21-20-16-11-15(7-8-17(16)33-2)35(25,26)10-9-34-37(30,31)32/h3-8,11,18,27,30H,9-10H2,1-2H3
charge 0 multiplicity 1
57 atoms
S  -4.86555 0.273835 0.527695
S  7.396049 -3.913237 -0.459904
S  -6.380064 -4.537183 -1.929033
O  -4.111793 -0.515375 1.746218
O  -6.419143 0.78043 0.637058
O  -5.484223 -2.933914 -1.945183
O  2.519813 1.161643 -1.225033
O  -1.504605 5.131228 -0.829953
O  8.871441 -2.779669 -0.528205
O  7.58587 -4.915564 0.796859
O  7.131089 -4.496334 -1.945999
O  -5.23684 -5.333403 -0.71798
O  -7.827268 -4.417355 -1.232394
O  -6.190604 -5.152413 -3.388696
N  3.319681 0.362697 0.886515
N  3.070293 0.632337 2.280139
N  0.264697 1.916786 0.768861
N  -0.267258 2.993353 0.267975
C  1.723795 2.089303 0.981159
C  -4.787013 -0.912701 -1.024895
C  -3.81392 1.769552 0.044594
C  2.164262 1.586961 2.34956
C  2.538776 1.168928 0.027202
C  4.274373 -0.6364 0.554968
C  -2.449095 1.74501 0.325191
C  -5.589423 -2.161041 -0.674785
C  -1.674745 2.895153 0.021372
C  -4.476235 2.883924 -0.503029
C  -2.314306 4.046857 -0.557595
C  1.630217 2.090557 3.651094
C  -3.716054 4.026397 -0.809348
C  4.954185 -1.311557 1.605612
C  4.539187 -0.956472 -0.805957
C  6.15042 -2.589031 -0.051842
C  5.90763 -2.299229 1.300786
C  5.494112 -1.94471 -1.111996
C  -2.11473 6.331988 -1.426189
H  2.022047 3.143825 0.80219
H  -5.230031 -0.329757 -1.845857
H  -3.716789 -1.11476 -1.179006
H  -1.963487 0.881848 0.79384
H  -6.644887 -1.919311 -0.453367
H  -5.128089 -2.723577 0.155324
H  -5.561103 2.859497 -0.652922
H  0.539815 1.912386 3.709079
H  1.785144 3.181228 3.749943
H  2.120395 1.58048 4.494986
H  -4.215428 4.900221 -1.234473
H  4.727791 -1.053364 2.641346
H  4.007605 -0.436353 -1.60473
H  6.435621 -2.839833 2.092043
H  5.709504 -2.21669 -2.149746
H  -2.561587 6.102615 -2.411341
H  -2.875223 6.767856 -0.751893
H  -1.278164 7.033153 -1.549733
H  9.672061 -3.34431 -0.736645
H  -5.726217 -6.100504 -0.297381
