program: Gaussian 09
title: 000092357
version: EM64L-G09RevD.01
frameworkgroup: C1[X(C5H8ClNO2)]
method: RPBEPBE
basis: SDD
operation: Freq
keyword: #p
keyword: freq=noraman
keyword: PBEPBE/SDD
title: #p freq=noraman PBEPBE/SDD
converged: NO YES NO NO
title: Mulliken charges:
elementType: Cl O O N C C C C C H H H H H H H H
charge: 0.146658 -0.221519 -0.195686 -0.465622 0.303216 -0.345273 -0.683612 -0.695757 0.292991 0.234071 0.239944 0.220881 0.242164 0.236067 0.234953 0.239288 0.217237
chargesum: 0.00000
title: Mulliken charges with hydrogens summed into heavy atoms:
elementType: Cl O O N C C C C C
charge: 0.146658 -0.221519 -0.195686 -0.465622 0.303216 0.128742 0.015500 -0.004278 0.292991
polarizability: 8.75376129e+01 3.33267968e+00 8.23646621e+01 -2.00281562e+00 -5.24786545e-01 5.45939096e+01
1716.lowfreq: -14.7170 -0.0017 -0.0011 0.0020 13.9599 16.4655 87.7271 126.2418 184.2251
frequency: 87.6933 126.2004 184.2104 184.8710 196.5082 238.9816 280.0667 314.7798 342.3359 444.4963 449.5980 527.0503 580.1945 638.2761 664.1125 820.3351 896.4536 920.7632 923.9150 942.0113 973.4237 997.7663 1013.6720 1114.6954 1148.5041 1195.6226 1249.9883 1261.0341 1337.2086 1380.2946 1398.6036 1454.6365 1466.1304 1471.1915 1475.8335 1486.5543 1736.2458 2989.1318 2993.5668 3029.4675 3087.7594 3091.5461 3096.6568 3102.9336 3119.2515
redmass: 4.5428 4.2695 1.8189 5.6313 1.8152 1.1450 3.1580 2.5795 2.7103 4.3721 3.2904 4.6964 5.1756 7.5980 11.9003 3.3126 6.4251 2.5489 1.9797 1.8041 2.1398 2.7335 1.4708 5.5910 1.3348 2.5531 2.4408 3.1339 1.3639 1.2143 1.2055 1.0528 1.0511 1.0727 1.0664 1.0550 12.8788 1.0353 1.0360 1.0606 1.0998 1.1001 1.1000 1.1008 1.1075
irintensity: 1.7062 4.3941 1.1808 1.4784 0.9350 0.3089 1.9460 1.8327 3.7437 2.2018 9.2064 2.5650 11.3146 3.4368 22.2231 4.2984 73.7488 60.2413 3.2768 22.9459 32.9878 9.3607 9.4846 93.1839 3.1322 40.6201 18.5149 30.8960 6.4345 30.2876 17.9807 1.3004 2.0424 17.9904 9.0922 12.2809 496.0822 12.4308 13.2658 37.2487 4.7161 23.7431 18.0481 18.4242 19.9850
temp: 298.150 k
press: 1.00000 atm
elementType: 17 8 8 7 6 6 6 6 6 1 1 1 1 1 1 1 1
symmnumber: 1
zpe: 337553.7 jmol-1
zpe.correction: 0.128567 hartree
zpe.thermalcorrener: 0.138006 hartree
zpe.thermalcorrenthalpy: 0.138950 hartree
zpe.thermalcorrgfe: 0.094109 hartree
zpe.sumelectzpe: -859.847264 hartree
zpe.sumelectthermal: -859.837825 hartree
zpe.sumelectthermalent: -859.836881 hartree
zpe.sumelectthermalfe: -859.881722 hartree
dipole: 5.8565 -2.0456 0.0900
dipole: 6.2041
quadrupole: -63.4386 -63.6604 -58.3465
quadrupole: 6.2693 -0.1855 -1.3253
quadrupole: -1.6234 -1.8452 3.4686 6.2693 -0.1855 -1.3253
hfenergy: -859.9758312 hartree
pointgroup: C01 [X(C5H8Cl1N1O2)]
dipole: 2.4242851 -0.2654059 0.1016782 debye
dipolederiv: -0.0483597 0.0084602 0.0010784 0.0073001 -0.3642695 0.0005768 0.0316303 0.1672113 0.0622996 -0.7503176 0.2591279 -0.0880131 0.3320441 -1.0024554 0.0969158 -0.0408027 0.0275186 -0.2910232 -1.2804014 0.0142841 -0.1090296 0.2446419 -0.4499563 0.0437389 -0.147759 0.0054102 -0.3379168 -0.9558053 -0.3529345 -0.0361015 -0.2002143 0.199945 -0.1127194 -0.2175944 -0.4247015 -0.4071603 0.5938338 -0.2352861 -0.0458541 -0.1750734 -0.0357597 0.0539092 -0.014252 0.1575771 0.417063 0.3954989 -0.2352986 0.0745186 -0.0201332 0.2135614 -0.0025781 0.0681388 -0.1031057 0.3295566 -0.0693397 -0.0028366 0.0213634 0.0237238 0.0336087 0.0210886 0.0508987 -0.0040716 -0.1650254 -0.0638135 -0.0139654 -0.0344619 -0.0430106 0.0433596 -0.0391074 -0.0458468 -0.0284494 -0.0423713 2.0726142 0.3921767 0.1932524 -0.2704546 1.2650702 -0.0648851 0.283895 0.1710419 0.3309648 0.0088014 0.0795408 0.0164617 0.0768298 -0.0147829 -0.0480176 0.0448663 -0.0859217 0.0387543 -0.004419 0.0313111 -0.0106551 -0.0023632 0.0659344 0.0193163 -0.048003 0.0939967 -0.1350683 -0.0751011 0.103055 0.0347583 0.1202585 0.0310205 -0.0163295 0.0304119 0.0107967 0.0811014 -0.0138517 -0.0602321 -0.1079959 -0.0458547 0.0698517 -0.0529831 -0.0674607 -0.0268609 -0.0022496 0.1016531 -0.0308055 0.0139105 -0.0662068 -0.0828942 0.0690833 0.0146743 0.0089638 0.0698696 0.0751355 -0.03625 -0.0022362 -0.1005472 -0.06935 0.0322028 0.0032798 0.0735111 0.075419 0.06879 -0.0096374 0.082902 -0.0175657 0.0945425 0.0114275 0.0396021 -0.0056206 -0.1130001 -0.0549179 0.0892902 -0.0038979 0.1366259 0.0025738 -0.0116391 0.0143216 -0.0372959 0.0887867 unknown
polarizability: 83.7283253|-3.9330961|85.8027164|3.2512948|-2.47661|54.9651429 unknown
InChI: InChI=1S/C5H8ClNO2/c1-5(2)3-9-4(8)7(5)6/h3H2,1-2H3
charge 0 multiplicity 1
17 atoms
Cl -0.271489 2.374115 -0.076936
O  -0.935092 -1.533386 -0.006895
O  -2.529262 0.188663 -0.21729
N  -0.208815 0.592441 0.262142
C  1.071303 -0.150707 0.025405
C  0.51093 -1.563955 0.37817
C  1.524233 -0.064806 -1.45066
C  2.173053 0.298576 0.996407
C  -1.363558 -0.17085 -0.02225
H  0.986398 -2.37065 -0.199434
H  0.573331 -1.762518 1.462205
H  2.445091 -0.65683 -1.597724
H  0.745285 -0.455594 -2.129605
H  1.740575 0.980223 -1.732405
H  2.519337 1.316655 0.746788
H  1.802275 0.303229 2.03541
H  3.041405 -0.381306 0.928972
