program: Gaussian 09
title: 000092360
version: EM64L-G09RevD.01
frameworkgroup: C1[X(C4H6Cl2N2O)]
method: RPBEPBE
basis: SDD
operation: Freq
keyword: #p
keyword: freq=noraman
keyword: PBEPBE/SDD
title: #p freq=noraman PBEPBE/SDD
converged: YES YES NO NO
title: Mulliken charges:
elementType: Cl Cl O N N C C C C H H H H H H
charge: -0.005465 -0.007575 -0.263934 -0.093968 0.052608 -0.377484 -0.378567 -0.325949 -0.341792 0.324745 0.321452 0.263555 0.272762 0.283248 0.276364
chargesum: 0.00000
title: Mulliken charges with hydrogens summed into heavy atoms:
elementType: Cl Cl O N N C C C C
charge: -0.005465 -0.007575 -0.263934 -0.093968 0.052608 -0.052739 -0.057116 0.210369 0.217820
polarizability: 1.08778060e+02 3.14631779e+00 7.97074996e+01 -1.62016454e+00 -1.90546083e+00 4.79299774e+01
1716.lowfreq: -8.5793 0.0020 0.0029 0.0029 4.6154 11.3927 40.0003 85.0601 149.8116
frequency: 39.9452 85.0345 149.8100 164.3618 209.3144 281.0146 301.7296 354.4864 369.4385 429.6191 499.7143 672.4847 736.0012 777.9605 816.2472 930.5113 945.6351 1020.9558 1056.5640 1071.2477 1138.8915 1153.2108 1174.3800 1195.6657 1215.4720 1250.8745 1259.5484 1282.0185 1304.4562 1317.9720 1346.4311 1473.8373 1482.3645 3009.9556 3019.9097 3079.0632 3089.1478 3099.7199 3110.9619
redmass: 6.1673 4.5046 11.2298 9.5480 3.9768 3.7340 7.5624 7.3902 5.8834 4.6248 4.1472 3.1557 6.2895 6.5086 5.1293 2.3226 1.3699 2.1770 3.1978 4.0574 2.0100 1.1901 1.9266 1.9422 1.6794 1.2629 1.2838 1.7775 1.6304 1.5808 2.4946 1.0748 1.0765 1.0647 1.0609 1.0989 1.0909 1.0930 1.0974
irintensity: 8.5376 0.6315 0.7524 8.3522 5.3789 3.4722 0.6758 8.3988 2.2770 4.9303 8.7729 21.4970 11.3729 43.7450 12.6959 21.0330 4.5377 7.8821 10.1271 74.2322 36.0080 0.9745 24.8131 76.0784 16.1035 38.2724 7.7269 54.1693 3.9599 6.9918 65.3426 12.8524 8.2873 16.3479 1.6359 2.0150 2.0355 2.5690 11.0334
temp: 298.150 k
press: 1.00000 atm
elementType: 17 17 8 7 7 6 6 6 6 1 1 1 1 1 1
symmnumber: 1
zpe: 274638.4 jmol-1
zpe.correction: 0.104604 hartree
zpe.thermalcorrener: 0.113671 hartree
zpe.thermalcorrenthalpy: 0.114615 hartree
zpe.thermalcorrgfe: 0.068639 hartree
zpe.sumelectzpe: -1260.101589 hartree
zpe.sumelectthermal: -1260.092522 hartree
zpe.sumelectthermalent: -1260.091578 hartree
zpe.sumelectthermalfe: -1260.137554 hartree
dipole: -1.8213 -0.8135 0.3945
dipole: 2.0333
quadrupole: -90.7815 -67.4128 -62.1775
quadrupole: 0.2495 0.7687 0.8650
quadrupole: -17.3243 6.0445 11.2798 0.2495 0.7687 0.8650
hfenergy: -1260.2061931 hartree
pointgroup: C01 [X(C4H6Cl2N2O1)]
dipole: -0.7096603 0.3292483 -0.1671269 debye
dipolederiv: -0.5121727 0.1904639 -0.0187053 0.2040268 -0.2764585 0.0004827 -0.0996814 0.0473205 -0.1541533 -0.3810073 -0.1927937 0.0280149 -0.2539357 -0.4129516 0.0234826 0.1157415 0.0981516 -0.1655045 -0.917134 0.0265873 -0.0555034 0.8628305 -0.3903647 0.0319565 0.0595572 -0.0235648 -0.2115231 -1.1265705 0.2611087 -0.0414566 -0.1348367 -0.0868693 0.0282542 -0.0578001 0.0077763 -0.1786009 1.5291813 -0.2104789 0.1194965 -0.5443839 -0.017285 -0.0097623 0.0995859 -0.0134751 -0.0456519 0.6391794 -0.3841423 0.0890549 -0.3139884 0.2628885 -0.0540743 0.1567819 -0.0129111 0.1670152 0.421437 0.3960631 -0.066471 0.3293297 0.5196567 -0.1233907 -0.1503258 -0.1123869 0.1955949 0.2008001 -0.1998706 0.0415291 -0.0746726 0.1859769 0.007956 -0.0999721 -0.0458371 0.2479753 0.0210245 0.0481397 -0.0474099 -0.0905104 0.0699874 0.0132302 0.0134181 -0.0259958 0.2466395 0.0002099 0.0439855 -0.0189358 0.0221773 0.0368324 0.0490607 -0.0114171 0.0257868 -0.0282433 0.0263219 -0.0428053 -0.0048916 -0.0210329 0.0118556 0.0570126 -0.0038605 0.0339605 -0.0352904 0.0145135 0.0590745 -0.012604 0.0686154 0.017406 0.0438648 -0.0013373 0.0952359 -0.0467967 0.0396325 -0.0345036 -0.0329803 0.015051 0.0064826 -0.0594153 -0.0062359 -0.082103 0.0237834 0.0449494 0.009236 -0.0257797 -0.0367132 0.0328727 0.0352833 -0.028786 0.0657459 -0.0056273 -0.0003649 0.0299358 0.046642 -0.0319567 0.0399703 -0.0439411 0.0143315 -0.0577038 -0.0096169 unknown
polarizability: 108.6326809|-3.7111268|79.6612356|1.6510506|-3.1532217|48.1216207 unknown
InChI: InChI=1S/C4H6Cl2N2O/c5-3-1-8(7-9)2-4(3)6/h3-4H,1-2H2
charge 0 multiplicity 1
15 atoms
Cl -2.754176 1.516638 -0.178521
Cl -2.087933 -2.117389 0.24077
O  3.136256 -0.494916 0.016276
N  1.067489 0.3076 -0.072244
N  2.399905 0.561651 0.108408
C  -1.218734 0.585509 0.349515
C  -1.023823 -0.726502 -0.431181
C  0.062987 1.392161 0.038456
C  0.481452 -1.04732 -0.294356
H  -1.343539 0.396912 1.426327
H  -1.333629 -0.612424 -1.480524
H  -0.042041 1.943549 -0.914436
H  0.338427 2.100551 0.834496
H  0.701727 -1.699072 0.570749
H  0.911532 -1.523247 -1.191334
