program: Gaussian 09
title: 000092369
version: EM64L-G09RevD.01
frameworkgroup: C1[X(C16H18)]
method: RPBEPBE
basis: SDD
operation: Freq
keyword: #p
keyword: freq=noraman
keyword: PBEPBE/SDD
title: #p freq=noraman PBEPBE/SDD
converged: NO YES NO NO
title: Mulliken charges:
elementType: C C C C C C C C C C C C C C C C H H H H H H H H H H H H H H H H H H
charge: -0.586029 -0.581216 0.516298 0.513832 0.487129 -0.410552 -0.410433 -0.409192 -0.409404 -0.532034 -0.407148 -0.407194 -0.672187 -0.227980 -0.227975 -0.243715 0.222393 0.222377 0.222194 0.222188 0.228104 0.228098 0.227648 0.227654 0.207828 0.207824 0.230249 0.230248 0.221938 0.215078 0.221907 0.222669 0.222675 0.226730
chargesum: 0.00000
title: Mulliken charges with hydrogens summed into heavy atoms:
elementType: C C C C C C C C C C C C C C C C
charge: -0.141260 -0.136834 0.516298 0.513832 0.487129 -0.182448 -0.182334 -0.181545 -0.181750 -0.116382 -0.176899 -0.176946 -0.013265 -0.005312 -0.005300 -0.016985
polarizability: 2.52946360e+02 -1.01598273e-02 1.64070550e+02 1.31888130e+01 3.46733262e-02 9.32180148e+01
1716.lowfreq: -17.7012 -8.9076 -4.2807 -0.0006 -0.0002 0.0004 6.0067 24.3662 27.2802
frequency: -11.1308 24.0406 26.8952 34.8633 39.1202 86.8331 145.0774 207.0426 209.5315 274.0762 286.0585 339.1156 384.2342 403.5881 405.6429 405.9600 455.2786 505.3612 546.7575 598.0940 617.4156 638.5650 702.2655 711.4941 750.9193 758.9376 782.3017 787.3675 801.7990 822.4309 850.9888 853.5271 861.3190 917.1110 953.8339 969.6415 972.0150 975.3955 981.9677 989.9255 992.0773 1003.8072 1013.7434 1026.4612 1043.5544 1063.4346 1076.8545 1117.6034 1142.7499 1171.6123 1186.5565 1189.1861 1214.0067 1216.4822 1219.0190 1242.5414 1264.6535 1265.0462 1313.6448 1318.5056 1319.8957 1327.1257 1380.1157 1382.2554 1388.3046 1409.9596 1439.6905 1471.6201 1472.5683 1473.5136 1483.2235 1487.5003 1488.9463 1507.4022 1582.2039 1592.6094 1613.4143 1623.6891 2976.8339 2983.2091 2984.0352 2992.2077 3030.8240 3034.5958 3058.3292 3075.3243 3081.2221 3104.1743 3105.6695 3112.2061 3112.3792 3126.3493 3129.6650 3133.2398 3141.5124 3160.7071
redmass: 2.5505 3.6412 3.2762 3.0019 4.2150 4.3858 4.5145 1.1567 4.3409 3.7137 1.8463 2.2735 2.3807 2.8194 2.8341 4.4878 3.9162 3.5813 3.0984 3.2381 6.3656 6.6463 2.3206 2.2307 3.6024 2.0343 1.1705 1.1825 4.6651 1.9330 1.2471 1.2475 2.3834 1.5282 1.3820 2.3606 1.3851 1.3973 1.6515 6.2970 1.3708 3.8627 2.8306 2.1946 1.4611 2.0530 1.4899 1.2803 1.1308 1.0514 1.1157 1.1036 3.1516 2.6518 1.9004 1.2617 1.4623 1.2376 1.5095 1.2405 1.4175 1.2536 6.0938 7.5605 1.1978 2.6716 2.1805 1.0429 1.1182 1.0877 2.1997 1.0984 1.0941 2.6170 6.5451 6.0592 6.1669 6.4790 1.0350 1.0590 1.0597 1.0597 1.1010 1.1017 1.1048 1.1000 1.1012 1.0866 1.0868 1.0881 1.0860 1.0962 1.0905 1.0973 1.0957 1.1014
irintensity: 0.0109 0.0046 0.0094 0.0104 0.2348 0.0097 0.6173 0.0750 0.1220 1.0827 0.0799 0.3452 0.0389 0.0000 0.0006 0.0668 0.6387 11.2700 36.2598 7.2782 0.0617 0.0131 28.0558 28.2187 1.6886 28.7556 2.6707 0.1987 0.9429 47.9749 0.0186 0.0012 15.2940 2.2165 0.1195 7.1340 0.0063 0.0231 0.0022 0.0844 0.0904 0.1192 4.7294 7.6941 5.6284 19.1195 6.9411 0.4361 13.3558 0.1557 0.1387 0.4429 0.1146 0.1365 0.0725 0.2535 9.4003 0.0035 2.4705 0.0065 0.0873 0.1451 0.4478 0.4364 9.3911 3.3678 6.1936 14.1868 0.8577 1.3894 21.5704 9.5079 10.5111 42.0267 0.0749 1.6549 14.5743 0.7075 42.4734 3.8377 39.0487 63.8400 0.0133 8.7081 26.8677 65.6206 40.8478 0.0311 37.2218 4.9468 13.5292 50.0576 9.4963 0.5851 46.8728 27.9728
temp: 298.150 k
press: 1.00000 atm
elementType: 6 6 6 6 6 6 6 6 6 6 6 6 6 6 6 6 1 1 1 1 1 1 1 1 1 1 1 1 1 1 1 1 1 1
symmnumber: 1
zpe: 759298.8 jmol-1
zpe.correction: 0.289202 hartree
zpe.thermalcorrener: 0.303419 hartree
zpe.thermalcorrenthalpy: 0.304363 hartree
zpe.thermalcorrgfe: 0.245138 hartree
zpe.sumelectzpe: -619.356461 hartree
zpe.sumelectthermal: -619.342244 hartree
zpe.sumelectthermalent: -619.341300 hartree
zpe.sumelectthermalfe: -619.400525 hartree
dipole: 0.4856 -0.0004 0.1259
dipole: 0.5017
quadrupole: -86.7530 -86.2963 -103.4535
quadrupole: -0.0029 2.7678 0.0108
quadrupole: 5.4146 5.8713 -11.2859 -0.0029 2.7678 0.0108
hfenergy: -619.6456625 hartree
pointgroup: C01[X(C16H18)]
dipole: 0.1903634 0.0006122 -0.0521394 debye
polarizability: 252.5561949|0.1523206|164.0655727|-15.3652022|0.5935576|93.6131573 unknown
InChI: InChI=1S/C16H18/c1-2-14-8-10-16(11-9-14)13-12-15-6-4-3-5-7-15/h3-11H,2,12-13H2,1H3
charge 0 multiplicity 1
34 atoms
C  -0.432038 -0.006471 0.795763
C  -1.188423 0.005044 -0.572785
C  1.078995 -0.005023 0.622002
C  -2.699189 0.003236 -0.395056
C  3.927549 -0.001395 0.221265
C  1.804315 1.21076 0.531993
C  1.804283 -1.218956 0.509959
C  3.202623 1.212583 0.335867
C  3.202603 -1.21723 0.313817
C  5.429434 0.000956 -0.030772
C  -3.418787 -1.216071 -0.297226
C  -3.419345 1.220538 -0.277603
C  5.775293 0.016881 -1.544104
C  -4.816358 -1.221361 -0.087618
C  -4.816914 1.221875 -0.067933
C  -5.521287 -0.000767 0.029016
H  -0.753737 -0.899942 1.364603
H  -0.753666 0.87731 1.379577
H  -0.867021 -0.87892 -1.156336
H  -0.867323 0.89892 -1.1412
H  1.268621 2.164106 0.628639
H  1.268544 -2.173882 0.589285
H  3.742137 2.166929 0.280285
H  3.742065 -2.170432 0.240967
H  5.889525 0.884555 0.452275
H  5.889239 -0.892686 0.433695
H  -2.879145 -2.167177 -0.392828
H  -2.880077 2.173274 -0.357865
H  5.354837 -0.869447 -2.053245
H  6.870131 0.017952 -1.699616
H  5.355825 0.914384 -2.034149
H  -5.355127 -2.173592 -0.019568
H  -5.356123 2.17264 0.015433
H  -6.60556 -0.002293 0.188163
