program: Gaussian 09
title: 000092353
version: EM64L-G09RevD.01
frameworkgroup: C1[X(C7H6Cl2O2)]
method: RPBEPBE
basis: SDD
operation: Freq
keyword: #p
keyword: freq=noraman
keyword: PBEPBE/SDD
title: #p freq=noraman PBEPBE/SDD
converged: YES YES NO NO
title: Mulliken charges:
elementType: Cl Cl O O C C C C C C C H H H H H H
charge: -0.013911 -0.051747 -0.264209 -0.446389 0.309721 0.283548 -0.222638 -0.377262 -0.262833 -0.058126 -0.516075 0.250602 0.282847 0.217963 0.262274 0.238313 0.367925
chargesum: 0.00000
title: Mulliken charges with hydrogens summed into heavy atoms:
elementType: Cl Cl O O C C C C C C C
charge: -0.013911 -0.051747 -0.264209 -0.078464 0.309721 0.283548 -0.222638 -0.126660 0.020014 -0.058126 0.202474
polarizability: 1.46152151e+02 -1.98249261e+00 1.16333149e+02 7.99784229e-01 1.49854674e+00 4.46676505e+01
1716.lowfreq: -7.9806 -0.0032 -0.0032 -0.0017 4.0634 4.8682 57.6405 77.3138 134.6790
frequency: 57.6003 77.3032 134.6755 153.4369 178.6326 198.8680 220.3379 271.8506 293.1354 326.3541 345.3066 384.7207 414.5495 489.2980 521.5644 562.0993 578.8815 662.9104 728.5501 787.7424 814.4770 837.5082 895.6371 954.4031 1073.9589 1111.4264 1119.6670 1153.8715 1204.6384 1213.2425 1267.0278 1372.9315 1390.8474 1430.3297 1456.0038 1471.4673 1479.7092 1581.1949 1587.9314 2984.4313 3093.2487 3135.6057 3146.7741 3191.7485 3584.1062
redmass: 2.1197 3.7756 2.3303 2.8197 15.4907 5.5904 5.0784 4.5681 5.2196 1.8540 2.7522 13.6822 5.9783 6.3544 4.4907 4.1954 5.8202 5.9174 5.7825 8.7052 1.4901 1.3822 10.5787 9.1974 2.0624 1.2407 1.7347 1.3406 1.6083 2.3197 3.0393 6.0296 4.5346 1.2485 1.1154 2.2302 1.1333 7.3584 7.9982 1.0330 1.1000 1.1045 1.0927 1.0934 1.0662
irintensity: 5.2725 0.5783 2.5135 1.5838 0.3096 6.8635 1.1094 4.6674 9.9146 90.4247 43.9474 1.3807 6.9489 2.9188 2.9141 10.2447 12.1999 39.9431 17.6906 49.1755 33.3884 26.2156 127.4739 38.6591 23.4650 6.9335 13.9075 12.4656 20.1893 229.5553 93.6952 5.5440 58.5323 3.3954 28.6845 189.3106 2.9687 36.7029 68.9243 71.4228 29.3320 13.9168 2.4661 1.5500 46.6541
temp: 298.150 k
press: 1.00000 atm
elementType: 17 17 8 8 6 6 6 6 6 6 6 1 1 1 1 1 1
symmnumber: 1
zpe: 298707.6 jmol-1
zpe.correction: 0.113772 hartree
zpe.thermalcorrener: 0.124992 hartree
zpe.thermalcorrenthalpy: 0.125936 hartree
zpe.thermalcorrgfe: 0.075879 hartree
zpe.sumelectzpe: -1340.067267 hartree
zpe.sumelectthermal: -1340.056047 hartree
zpe.sumelectthermalent: -1340.055103 hartree
zpe.sumelectthermalfe: -1340.105160 hartree
dipole: -0.0478 -3.5110 1.1830
dipole: 3.7052
quadrupole: -79.1975 -66.6075 -79.6663
quadrupole: 1.4465 -4.6968 0.0161
quadrupole: -4.0404 8.5496 -4.5091 1.4465 -4.6968 0.0161
hfenergy: -1340.1810388 hartree
pointgroup: C01 [X(C7H6Cl2O2)]
dipole: 0.1304853 1.3133924 0.6188851 debye
dipolederiv: -0.2227794 0.2506116 0.0278329 0.2811133 -0.5868931 -0.0642124 0.0190398 -0.0469497 -0.0480463 -0.838695 0.0307429 0.0159633 0.0343151 -0.1386191 -0.00697 0.0316747 -0.0095971 -0.0653595 -1.5114571 -0.2216919 -0.2385265 -0.2752686 -0.3027129 -0.0104426 0.0171988 -0.0163343 -0.3345718 -0.4046422 -0.5146842 -0.0087684 -0.5076516 -1.1184425 -0.0150976 -0.0274216 -0.0193784 -0.404267 1.1937769 0.2964243 0.0945525 -0.1455924 -0.3630325 -0.1145688 -0.1924079 -0.0903583 -0.0111183 0.2523143 0.3316662 -0.0253845 0.5458592 1.0815686 0.0351672 0.0798534 0.0477007 0.0770605 0.3258658 -0.3534298 -0.0756657 -0.3746835 0.9375703 0.1149512 -0.0976407 0.0996436 -0.0568759 -0.4049818 -0.1982384 -0.005214 0.0223527 -0.1780771 0.0033055 0.0180982 0.007196 -0.1717099 -0.4839813 0.0912503 0.0137436 0.16388 -0.2939225 -0.0243456 0.0181295 -0.0239365 -0.1052225 1.1758657 0.0107753 -0.0334566 -0.153902 0.3073017 0.0335678 -0.0627418 0.0361865 -0.0413654 0.6315979 0.1124579 0.1783414 0.3604489 0.291905 0.064137 0.3235943 0.0574748 0.4378412 0.0709463 0.0314387 0.0045539 0.0433396 -0.0459773 -0.0167382 0.0013475 -0.0222021 0.183921 0.0764455 -0.0350916 -0.001544 -0.036978 0.0462017 -0.0097422 0.0053623 -0.0135903 0.1804999 0.0290975 -0.0487734 0.0556695 -0.0669234 0.0294892 0.0798483 -0.1177089 0.0398314 -0.1637712 0.1186473 0.028875 -0.0133822 -0.0783492 -0.0954599 -0.0385587 -0.0544623 -0.0128558 0.0604913 -0.1503957 0.0188621 0.0143945 0.0618645 0.09801 -0.0280506 0.0367725 -0.0323444 0.0756158 0.1423751 0.1688049 -0.0031097 0.1261755 0.3310903 -0.0022504 0.0013123 -0.0004862 0.3868781 unknown
polarizability: 145.5238693|-4.7768085|116.3858986|1.38302|6.4576366|45.2431825 unknown
InChI: InChI=1S/C7H6Cl2O2/c1-11-7-5(9)2-4(8)3-6(7)10/h2-3,10H,1H3
charge 0 multiplicity 1
17 atoms
Cl 0.903974 -2.903832 -0.305598
Cl -3.821349 -0.020022 0.088052
O  2.20907 -0.223648 -0.22373
O  0.895054 2.277974 0.070357
C  0.827903 -0.13065 -0.075443
C  0.121798 1.105713 0.039518
C  0.051153 -1.314032 -0.149954
C  -1.289446 1.140689 0.101161
C  -1.358621 -1.3108 -0.111933
C  -2.002289 -0.068965 0.020449
C  3.065169 0.425873 0.796087
H  -1.822563 2.093211 0.195238
H  -1.92241 -2.243597 -0.174209
H  2.838555 0.019292 1.799674
H  2.930295 1.519182 0.784403
H  4.091065 0.156027 0.505458
H  0.317243 3.080887 0.08257
