program: Gaussian 09
title: 000092441
version: EM64L-G09RevD.01
frameworkgroup: C1[X(C27H22ClN3O4)]
method: RPBEPBE
basis: SDD
operation: Freq
keyword: #p
keyword: freq=noraman
keyword: PBEPBE/SDD
title: #p freq=noraman PBEPBE/SDD
converged: YES YES NO NO
title: Mulliken charges:
elementType: Cl O O O O N N N C C C C C C C C C C C C C C C C C C C C C C C C C C C H H H H H H H H H H H H H H H H H H H H H H
charge: -0.048700 -0.208323 -0.224139 -0.223532 -0.270385 -0.316577 -0.209689 -0.015493 0.246107 0.237519 0.300915 0.135255 0.150342 0.153704 -0.026766 -0.013029 0.043012 0.041005 -0.445352 -0.391791 -0.386043 -0.350867 -0.395739 0.349887 0.020869 -0.392247 -0.257665 -0.348001 -0.326412 -0.195387 -0.103791 -0.239258 -0.371723 -0.346183 -0.686840 0.284470 0.284952 0.241013 0.243200 0.283966 0.287442 0.240873 0.240038 0.187043 0.185652 0.300176 0.283203 0.260368 0.178382 0.179009 0.206287 0.206006 0.191818 0.192002 0.211932 0.211954 0.215529
chargesum: 0.00000
title: Mulliken charges with hydrogens summed into heavy atoms:
elementType: Cl O O O O N N N C C C C C C C C C C C C C C C C C C C C C C C C C C C
charge: -0.048700 -0.208323 -0.224139 -0.223532 -0.270385 -0.316577 -0.209689 -0.015493 0.246107 0.237519 0.300915 0.135255 0.150342 0.153704 -0.026766 -0.013029 0.043012 0.041005 -0.160882 -0.106838 -0.102077 0.133346 -0.108297 0.349887 0.020869 0.088664 0.115031 -0.047826 -0.043209 0.064981 -0.103791 0.118133 0.040570 0.037637 -0.047425
polarizability: 7.16373742e+02 3.24997357e+01 3.35696998e+02 -8.15464981e+01 3.52801759e+01 1.94751779e+02
1716.lowfreq: -4.0790 -1.8373 -0.0019 -0.0004 0.0012 5.9669 11.0860 12.0070 30.1594
frequency: 10.9868 11.6127 30.1518 39.2577 44.5117 53.6014 61.8219 82.5293 85.5592 89.9155 97.6051 102.2975 105.8498 116.3836 129.3678 139.9566 156.1910 172.9371 189.4174 201.1188 213.6971 233.3062 237.8295 260.5046 271.8198 275.6967 310.2494 318.4209 323.0897 357.2303 363.2911 373.4904 390.3049 402.6780 417.0709 428.1627 442.2582 447.8896 456.8911 463.2545 472.6067 475.5293 496.8529 525.6093 537.4984 587.0261 590.5451 598.5731 612.6894 625.8495 656.8471 684.9054 710.6900 713.8957 716.5592 741.3186 742.2068 750.5924 759.6848 765.0336 769.0047 792.7455 808.6248 819.9132 823.0803 828.3581 837.4267 881.8474 885.2580 886.1860 898.3689 900.5652 907.5074 919.3224 936.0118 948.7599 962.4482 966.7277 1011.8071 1015.5622 1023.0744 1044.5161 1046.0677 1057.9639 1065.4330 1066.7414 1076.7841 1088.3931 1092.4641 1127.7026 1128.0308 1138.4153 1140.0656 1156.3354 1169.0670 1181.7034 1199.2193 1208.0861 1211.2500 1220.8780 1237.5863 1255.3623 1265.3312 1267.8590 1272.6740 1280.2832 1281.6078 1282.5647 1287.6445 1314.8590 1332.8268 1342.8003 1346.0120 1358.8735 1367.3360 1379.4236 1383.6752 1392.9675 1406.2321 1410.8488 1412.4437 1420.3405 1438.3863 1444.0509 1449.2104 1455.9084 1468.2641 1471.5617 1475.6518 1478.3485 1481.5012 1488.7350 1495.3861 1509.6377 1537.8609 1557.9912 1566.5605 1584.2901 1586.6470 1603.7902 1612.1720 1615.2255 1622.0248 2900.1620 2911.2736 2950.3388 2952.6988 2965.8752 2975.2478 2991.9129 3009.1231 3015.1030 3038.4139 3054.6733 3073.3522 3074.4582 3076.0687 3107.7933 3157.8597 3159.7446 3172.5779 3174.2367 3176.3860 3186.9215 3200.7737
redmass: 5.5209 6.5638 8.1498 4.7407 1.6314 6.0557 7.1842 5.8400 6.5055 1.8829 3.5241 6.2843 6.4566 9.0365 1.8796 3.3530 4.0989 6.7467 5.8566 8.0458 8.7358 1.1315 5.8464 5.9015 7.2601 6.1054 5.2045 5.6449 5.8371 4.2001 6.6546 5.8054 6.1331 6.3806 7.0377 6.2648 3.6639 6.5502 4.4322 4.0446 6.3259 4.7406 4.8942 7.2634 8.2095 4.8042 6.0897 7.7684 5.7929 6.1467 7.8803 8.0653 5.2939 4.7065 9.7339 1.0741 5.3746 6.9665 4.5502 1.3715 4.7861 6.4412 1.1369 7.3820 5.7875 1.4639 2.2700 1.4834 2.4706 2.5786 1.4596 5.0059 1.4773 2.8458 1.1521 5.5655 1.3265 4.7187 1.3903 1.3857 4.5012 3.1561 2.2594 3.8185 4.8183 2.4046 2.7595 2.4626 3.0536 2.7182 2.5896 1.6662 1.4460 1.8917 1.8484 1.6424 2.8545 3.9770 1.3815 1.9137 1.9717 2.3352 1.9948 1.2681 1.1603 1.1575 1.3148 1.0900 3.8145 2.4984 5.1921 1.3615 1.5418 1.4487 2.1882 2.5285 3.5366 1.2195 6.6493 4.7936 1.5840 4.2678 4.2764 3.6513 1.3412 3.1393 1.0780 1.0703 1.0736 1.0423 1.0750 1.0840 1.0851 6.5103 7.6758 11.2871 6.8022 9.7791 8.3973 8.4204 9.2069 9.3483 9.8479 1.0545 1.0543 1.1056 1.1062 1.0588 1.0364 1.0593 1.1005 1.0592 1.0578 1.1038 1.1008 1.0998 1.1038 1.1066 1.0891 1.0893 1.0906 1.0962 1.0965 1.0940 1.0967
irintensity: 0.0775 0.0396 0.1581 0.2326 1.3041 0.0080 0.0811 0.1342 0.3573 1.6789 0.4122 0.0248 0.9192 12.0751 0.8403 5.7007 1.9795 1.4940 0.4620 2.6360 1.0963 0.1158 4.0953 0.1916 4.2234 1.1144 2.3296 0.4721 0.7822 15.3627 29.0249 22.7267 1.8540 1.0521 8.1005 1.7863 6.1661 4.4946 11.4863 1.4314 1.2157 4.7799 22.0496 5.8481 0.6391 13.7812 5.5218 0.1653 12.1815 3.0107 2.6974 19.7702 0.5087 11.3596 1.8300 8.5025 8.4525 0.2746 2.3008 18.5090 37.2253 2.6844 0.2851 1.4770 1.9455 56.3344 15.9467 19.6726 62.9257 1.5789 22.2823 46.4450 28.9430 6.6453 0.6348 1.6092 2.8606 46.3314 0.0597 0.0119 24.5242 1.5773 40.3417 19.2316 188.1241 57.4576 55.2718 5.0413 6.8218 16.3022 7.2268 5.6272 14.3238 10.5272 0.6919 18.0134 35.0736 33.9719 1.1261 10.1744 13.0914 57.7634 53.9191 1.0764 0.4620 0.1653 6.2419 0.1084 118.2781 417.3905 144.8196 19.9955 87.0756 49.5660 25.7063 1.7847 53.0785 7.7833 12.7657 5.1972 2.7416 20.6210 24.7344 135.8744 55.7348 13.9304 4.2439 0.7346 7.1865 12.5127 13.0811 3.2840 10.8936 37.1723 59.3107 218.2443 221.4886 134.5443 26.0010 228.5716 1.5056 17.5529 10.1138 27.4268 122.4473 76.5918 22.8122 39.7961 35.1791 40.3338 6.9957 6.9394 31.5780 23.8392 85.6008 63.4896 12.5079 5.2621 0.0124 0.2407 0.6450 0.0235 0.3035 0.4984 1.4962
temp: 298.150 k
press: 1.00000 atm
elementType: 17 8 8 8 8 7 7 7 6 6 6 6 6 6 6 6 6 6 6 6 6 6 6 6 6 6 6 6 6 6 6 6 6 6 6 1 1 1 1 1 1 1 1 1 1 1 1 1 1 1 1 1 1 1 1 1 1
symmnumber: 1
zpe: 1139336.5 jmol-1
zpe.correction: 0.433950 hartree
zpe.thermalcorrener: 0.464048 hartree
zpe.thermalcorrenthalpy: 0.464992 hartree
zpe.thermalcorrgfe: 0.369363 hartree
zpe.sumelectzpe: -1964.922497 hartree
zpe.sumelectthermal: -1964.892399 hartree
zpe.sumelectthermalent: -1964.891455 hartree
zpe.sumelectthermalfe: -1964.987084 hartree
dipole: 1.6885 0.7584 -0.9687
dipole: 2.0892
quadrupole: -209.4023 -215.5787 -212.1108
quadrupole: -5.2688 -4.8512 0.1032
quadrupole: 2.9616 -3.2148 0.2532 -5.2688 -4.8512 0.1032
hfenergy: -1965.356447 hartree
pointgroup: C01 [X(C27H22Cl1N3O4)]
dipole: -0.6575956 0.2977802 0.3930435 debye
polarizability: 714.2449927|-35.648|338.1345749|-86.6402773|-30.5776184|194.4429517 unknown
InChI: InChI=1S/C27H22ClN3O4/c1-2-3-12-35-13-4-11-30-25(32)17-7-6-16-22-19(9-8-18(23(17)22)26(30)33)27(34)31-21-10-5-15(28)14-20(21)29-24(16)31/h5-10,14H,2-4,11-13H2,1H3
charge 0 multiplicity 1
57 atoms
Cl 9.650474 -1.699888 -1.167376
O  4.015624 2.71895 -0.837447
O  -2.61994 -2.012553 1.842993
O  -2.944619 2.544945 0.861768
O  -7.296703 -0.338398 -0.466216
N  4.138542 0.438696 -0.338485
N  -2.768278 0.269611 1.361831
N  4.477244 -1.798199 0.102255
C  1.399273 0.348055 0.340941
C  0.004493 0.320258 0.681695
C  2.167335 -0.864238 0.439561
C  1.990316 1.58496 -0.088519
C  -0.597556 -0.90468 1.111258
C  -0.770335 1.518964 0.588484
C  3.573774 -0.805696 0.088274
C  3.433794 1.666664 -0.453901
C  -2.042224 -0.951664 1.464052
C  -2.221524 1.508041 0.934936
C  1.553272 -2.059048 0.864929
C  0.176626 -2.076178 1.197865
C  1.205282 2.749891 -0.171332
C  -4.22168 0.236796 1.687516
C  -0.171365 2.717741 0.165389
C  5.50514 0.18858 -0.609857
C  5.687086 -1.20754 -0.327671
C  -5.077596 -0.067528 0.438315
C  -6.571843 -0.077056 0.779321
C  6.554916 1.011021 -1.056185
C  6.95159 -1.814193 -0.491236
C  7.818568 0.399618 -1.218424
C  7.991363 -0.980861 -0.936836
C  -8.754634 -0.354095 -0.279475
C  -9.398336 -0.612497 -1.644762
C  -10.942945 -0.648639 -1.576773
C  -11.588001 -0.905754 -2.955779
H  2.160124 -2.966837 0.930415
H  -0.313421 -2.997417 1.527624
H  -4.483172 1.224979 2.101351
H  -4.363352 -0.543083 2.453902
H  1.684638 3.676698 -0.501762
H  -0.79271 3.616356 0.103793
H  -4.898217 0.698333 -0.337384
H  -4.798988 -1.051233 0.020073
H  -6.802281 -0.866936 1.531094
H  -6.884514 0.904451 1.205269
H  6.400686 2.070392 -1.267391
H  7.101295 -2.875127 -0.279768
H  8.672215 0.989588 -1.563164
H  -9.092836 0.62259 0.137426
H  -9.03514 -1.151367 0.44693
H  -9.014839 -1.5720 -2.042557
H  -9.069607 0.177893 -2.347059
H  -11.317683 0.311828 -1.16729
H  -11.263659 -1.43777 -0.866138
H  -11.309084 -0.11433 -3.676544
H  -11.253392 -1.873282 -3.374732
H  -12.691097 -0.929014 -2.887996
