program: Gaussian 09
title: 000092401
version: EM64L-G09RevD.01
frameworkgroup: C1[X(C19H15ClN2O2)]
method: RPBEPBE
basis: SDD
operation: Freq
keyword: #p
keyword: freq=noraman
keyword: PBEPBE/SDD
title: #p freq=noraman PBEPBE/SDD
converged: YES YES NO NO
title: Mulliken charges:
elementType: Cl O O N N C C C C C C C C C C C C C C C C C C C H H H H H H H H H H H H H H H
charge: -0.059053 -0.504062 -0.265358 -0.485055 0.000036 -0.396808 0.346364 0.290678 0.456608 -0.362320 -0.339073 -0.422086 -0.356476 -0.130694 -0.230524 -0.223030 -0.224439 0.124354 -0.233918 0.257299 -0.277787 -0.307372 -0.335502 -0.347632 0.233603 0.256337 0.315610 0.392284 0.234203 0.259822 0.257864 0.371439 0.234436 0.235906 0.236694 0.272580 0.237844 0.245827 0.241398
chargesum: 0.00000
title: Mulliken charges with hydrogens summed into heavy atoms:
elementType: Cl O O N N C C C C C C C C C C C C C C C C C C C
charge: -0.059053 -0.132623 -0.265358 -0.092771 0.000036 -0.163204 0.346364 0.290678 0.456608 -0.105982 -0.023462 -0.187883 -0.096654 -0.130694 0.027341 0.011406 0.011467 0.124354 0.002776 0.257299 -0.005207 -0.069528 -0.089675 -0.106235
polarizability: 3.24276768e+02 1.15684548e+01 2.29752561e+02 1.95077477e+01 -2.66320290e+01 1.77099998e+02
1716.lowfreq: -10.7114 -4.6133 -3.8406 -0.0019 -0.0015 -0.0011 11.0569 18.4530 25.1437
frequency: 6.2078 18.4175 25.0122 35.9627 53.9544 62.0725 89.7039 135.5524 140.1106 150.2719 183.7973 196.1793 214.0988 228.6226 262.6902 291.6988 313.3109 353.0268 363.7160 367.1807 379.1549 390.6662 402.2002 433.0511 437.9106 473.5542 501.3757 524.9224 564.2283 603.0574 615.7417 624.6899 659.7415 667.4193 680.5225 693.5277 701.2600 731.9715 754.3244 771.3735 782.3599 818.2226 839.8377 841.5639 850.6761 867.2639 876.4962 881.5900 888.9861 899.4126 923.2369 942.9854 959.9546 969.7888 976.5482 979.1968 989.8563 990.1010 1002.1244 1025.8662 1060.8168 1078.8991 1086.7089 1089.7692 1095.3883 1113.8296 1168.3127 1175.6817 1185.6504 1192.0611 1218.9680 1221.8980 1250.2534 1263.6690 1276.6176 1299.8471 1313.4870 1329.1202 1331.7878 1353.6212 1374.6603 1386.3921 1399.9407 1405.3833 1443.8708 1461.3808 1475.7497 1481.5323 1532.1508 1544.7311 1581.3593 1586.3428 1592.9369 1602.7638 1609.9473 1623.3224 2993.6672 3111.2737 3127.2942 3133.1626 3139.2440 3144.3150 3146.9147 3149.8098 3155.8285 3167.5307 3169.5196 3172.8488 3191.9212 3272.7882 3576.3993
redmass: 3.8116 6.0036 6.1259 5.6486 7.4996 6.0448 6.1599 7.3795 4.6598 8.4636 5.8936 5.4225 7.8375 6.7294 5.4615 3.6905 7.9313 5.6370 6.5236 2.5369 4.2822 1.6257 2.4856 5.9173 4.5281 4.2923 5.5642 3.5121 4.1013 5.3964 6.2567 7.5177 6.9754 7.1234 6.7191 4.3723 1.7641 4.2073 2.8987 2.0560 4.4024 3.4188 1.6784 1.5020 1.2679 4.3513 3.5408 1.6314 1.3074 1.5047 1.5074 3.1065 4.6926 1.5565 1.3319 1.3909 1.4469 6.0108 1.3249 2.2605 2.4270 2.2470 1.8604 1.6685 2.2888 2.3920 1.2785 1.0827 2.2766 1.1510 1.3988 1.2805 3.5346 1.4363 1.3837 6.1181 2.5193 1.4348 1.2678 1.7170 7.8470 6.7326 1.9287 3.1013 2.1558 1.9466 2.6887 2.2339 3.1204 6.0142 5.5302 7.7580 5.9518 6.2174 5.9795 2.3786 1.0858 1.0889 1.0876 1.0862 1.0898 1.0909 1.0923 1.0973 1.0957 1.0909 1.1013 1.0963 1.0956 1.0808 1.0663
irintensity: 0.1531 0.4485 0.0312 0.0017 1.0308 0.3319 1.1714 2.9885 0.4410 1.4404 7.0343 0.5242 2.5236 2.2237 1.9838 28.7514 10.0593 4.7748 6.6860 2.1239 14.8811 73.3592 11.4367 1.5595 10.4616 18.3657 3.8312 22.8366 15.4701 20.5245 3.2857 2.7593 2.3456 4.0273 64.5977 22.4792 43.2023 29.3449 10.0424 40.4449 2.8815 2.3973 67.1178 7.3572 3.4490 4.2950 35.5286 32.8931 54.7931 80.0869 12.2808 5.3350 4.5257 1.9745 3.7453 2.4097 1.1891 1.2731 0.2299 4.5636 10.7292 4.1505 3.5251 7.9585 34.4228 19.1675 56.3045 0.3476 3.3134 3.5685 22.7066 7.4271 47.5753 17.5672 25.6529 9.8255 95.3955 7.5566 3.0824 36.7685 101.4340 11.8245 8.1438 74.0396 9.1456 3.9953 112.9750 10.9484 506.6578 22.9721 18.6541 146.4577 3.7085 14.7903 0.5074 70.2865 30.2917 8.5881 9.0795 0.4252 25.7182 10.3691 2.0817 12.4587 24.2547 2.0755 18.1181 6.8424 8.3997 295.5952 11.6625
temp: 298.150 k
press: 1.00000 atm
elementType: 17 8 8 7 7 6 6 6 6 6 6 6 6 6 6 6 6 6 6 6 6 6 6 6 1 1 1 1 1 1 1 1 1 1 1 1 1 1 1
symmnumber: 1
zpe: 773204.6 jmol-1
zpe.correction: 0.294498 hartree
zpe.thermalcorrener: 0.315028 hartree
zpe.thermalcorrenthalpy: 0.315972 hartree
zpe.thermalcorrgfe: 0.240759 hartree
zpe.sumelectzpe: -1451.372548 hartree
zpe.sumelectthermal: -1451.352019 hartree
zpe.sumelectthermalent: -1451.351075 hartree
zpe.sumelectthermalfe: -1451.426287 hartree
dipole: -2.0388 5.2238 -1.2704
dipole: 5.7497
quadrupole: -171.8801 -137.1898 -138.5423
quadrupole: -8.9642 4.8385 -3.0529
quadrupole: -22.6760 12.0143 10.6618 -8.9642 4.8385 -3.0529
hfenergy: -1451.6670466 hartree
pointgroup: C01 [X(C19H15Cl1N2O2)]
dipole: 0.8514224 1.9818056 0.6816421 debye
polarizability: 326.0586612|-11.6271047|222.8232652|8.3643772|32.8974605|182.2474017 unknown
InChI: InChI=1S/C19H15ClN2O2/c20-15-6-7-17(22-19(24)14-8-10-21-11-9-14)16(12-15)18(23)13-4-2-1-3-5-13/h1-12,18,22-23H
charge 0 multiplicity 1
39 atoms
Cl 5.175272 -2.628939 -0.549433
O  0.20085 0.65903 1.97869
O  -1.750795 -2.336894 -1.490803
N  -0.626513 -0.995803 0.086949
N  -5.618566 -0.006267 0.882333
C  1.531441 0.705671 1.282971
C  1.75404 -0.602342 0.520407
C  0.727003 -1.374777 -0.114357
C  1.621169 1.966187 0.41945
C  3.100767 -1.011293 0.381986
C  1.083402 -2.509866 -0.895269
C  2.281124 3.107016 0.943683
C  1.024212 2.042303 -0.865433
C  3.42569 -2.138915 -0.389688
C  2.430893 -2.892392 -1.038123
C  2.336536 4.310005 0.204017
C  1.078036 3.243411 -1.603816
C  -1.761734 -1.497007 -0.534764
C  1.731745 4.380615 -1.071401
C  -3.068361 -0.950846 -0.002152
C  -4.219127 -1.076678 -0.81877
C  -3.224477 -0.356547 1.277042
C  -5.455906 -0.590575 -0.344654
C  -4.506055 0.092011 1.669264
H  2.303241 0.773808 2.074613
H  3.896202 -0.435723 0.866889
H  0.291475 -3.073529 -1.391415
H  -0.728011 -0.278027 0.827758
H  2.761594 3.051183 1.929511
H  0.530417 1.162617 -1.291302
H  2.695097 -3.766551 -1.639878
H  -0.006113 1.569115 2.308611
H  2.853213 5.183204 0.616819
H  0.616669 3.292559 -2.596089
H  1.775339 5.310027 -1.649665
H  -4.128376 -1.556899 -1.797478
H  -2.391122 -0.268717 1.983024
H  -6.360391 -0.666734 -0.957978
H  -4.660478 0.544562 2.655451
