program: Gaussian 09
title: 000092440
version: EM64L-G09RevD.01
frameworkgroup: C1[X(C22H23N7O3)]
method: RPBEPBE
basis: SDD
operation: Freq
keyword: #p
keyword: freq=noraman
keyword: PBEPBE/SDD
title: #p freq=noraman PBEPBE/SDD
converged: YES YES NO NO
title: Mulliken charges:
elementType: O O O N N N N N N N C C C C C C C C C C C C C C C C C C C C C C H H H H H H H H H H H H H H H H H H H H H H H
charge: -0.273094 -0.207884 -0.205726 -0.129405 -0.443491 -0.105565 -0.081879 0.013462 -0.049697 -0.018193 -0.418601 -0.410655 0.498582 -0.348680 -0.354648 -0.500679 -0.347413 0.326919 -0.673636 -0.671965 -0.055954 -0.287503 0.210021 -0.134988 -0.772602 0.340828 0.343713 0.437553 -0.528325 -0.524185 -0.179436 -0.222845 0.224097 0.244551 0.230140 0.228820 0.241952 0.199474 0.231011 0.209574 0.327203 0.244360 0.230766 0.228585 0.204080 0.214528 0.232258 0.211543 0.293944 0.395399 0.254789 0.253340 0.246875 0.313808 0.314874
chargesum: 0.00000
title: Mulliken charges with hydrogens summed into heavy atoms:
elementType: O O O N N N N N N N C C C C C C C C C C C C C C C C C C C C C C
charge: -0.273094 -0.207884 -0.205726 -0.129405 -0.048093 -0.105565 -0.081879 0.013462 -0.049697 -0.018193 0.050047 0.048305 0.498582 0.092746 0.085938 -0.173477 -0.103052 0.326919 -0.010205 -0.013636 -0.055954 0.006440 0.210021 -0.134988 -0.017598 0.340828 0.343713 0.437553 -0.214517 -0.209311 -0.179436 -0.222845
polarizability: 8.87368462e+02 -4.63226650e+00 3.75787000e+02 7.95311039e-01 -1.35509123e+01 1.47423286e+02
1716.lowfreq: -39.5054 -4.8203 -3.9908 -1.7841 -0.0008 -0.0003 0.0005 15.5611 19.6908
frequency: -39.5027 15.5067 19.6590 31.4688 32.9248 39.1401 44.9527 58.5350 60.7201 80.8637 86.0520 94.7415 95.7176 107.7303 110.0240 118.0810 127.7965 130.1077 158.5916 161.9759 177.9573 180.8590 218.4810 224.7883 229.9391 240.9883 259.4530 268.9830 270.1006 282.4649 302.5924 311.3632 330.2110 345.9333 363.5887 378.6642 386.3926 414.9840 420.5000 431.6666 445.6156 478.7530 484.8793 503.4161 512.3049 522.1252 546.6942 554.6029 576.8332 586.6048 609.8009 634.2247 649.2289 651.6757 676.1206 698.7739 702.4975 721.9645 749.7102 750.4803 753.6606 804.7448 812.5045 822.3919 856.0512 866.2185 871.7388 873.8695 884.8205 889.6890 909.9205 911.3101 915.9455 931.1648 956.8503 962.5248 969.5165 985.5041 990.3320 1007.7774 1036.5014 1046.7629 1048.6459 1084.8805 1087.0612 1099.1644 1105.6267 1120.4061 1161.1826 1184.7117 1189.2715 1195.5092 1210.4976 1222.2701 1228.5809 1240.8695 1249.8162 1250.8844 1281.2330 1288.0828 1291.3342 1296.3711 1299.5602 1306.4750 1325.8359 1348.7739 1350.6148 1358.3513 1372.1080 1384.1278 1387.2301 1390.0295 1395.7585 1396.0762 1421.2700 1432.0209 1441.4057 1459.2225 1462.3834 1473.0478 1476.0063 1478.6596 1479.2899 1481.8998 1485.2606 1494.6767 1501.6387 1514.3667 1524.4985 1531.5705 1563.2661 1583.3882 1619.4237 1627.2040 2156.6925 2183.8271 2979.8950 2980.5862 2989.2288 2990.5037 3003.0874 3007.0168 3008.9579 3035.2001 3040.4539 3060.6652 3064.5515 3078.3837 3081.4852 3086.3331 3087.0242 3093.5825 3144.7399 3161.2097 3176.9795 3181.5058 3187.5821 3204.3882 3387.8736
redmass: 1.1355 6.9102 4.6897 4.5187 4.2419 4.1593 5.1379 5.2064 15.3610 4.6013 3.2053 2.7570 2.1924 7.1668 4.9722 4.5047 3.3780 4.4793 6.8920 11.9626 5.8701 6.3509 1.5749 2.2650 1.2531 3.4224 6.4755 4.7680 4.9632 2.6959 3.7778 8.3819 4.2045 6.0670 6.5889 4.2914 5.9311 5.2531 6.5817 7.0703 8.9735 4.4263 6.2255 4.6583 4.9091 5.4089 5.9024 6.1243 3.1718 4.6484 4.2934 6.2487 5.4368 4.2430 5.8445 8.2959 7.3485 5.8137 1.1364 3.3481 1.1260 6.5811 2.0319 3.2682 1.9585 5.8540 1.2853 1.1226 1.6526 1.4689 1.5726 9.5268 2.4915 5.4749 1.3890 1.6292 7.4830 2.1374 1.3344 1.9292 1.6966 3.0615 2.9292 2.0626 1.9685 2.1018 2.1830 2.1540 1.8025 2.7019 2.3573 5.0421 2.0876 1.4994 2.2640 1.9287 3.5650 1.5068 1.3924 1.9566 1.2941 1.3386 1.3116 1.6506 3.3706 1.3775 1.4128 9.5319 4.2048 3.7404 2.0180 1.5458 1.2047 1.2045 4.1489 5.5215 1.2526 1.0482 2.3413 1.0837 1.0586 1.0695 1.0434 1.0533 1.1118 1.1308 1.7970 2.4670 2.6572 2.9672 8.8675 6.6299 4.6583 7.1891 12.6162 12.6329 1.0363 1.0362 1.0616 1.0605 1.0612 1.0605 1.0375 1.0993 1.0973 1.1035 1.1033 1.1025 1.1022 1.0989 1.0996 1.0965 1.1009 1.0874 1.0931 1.0965 1.0935 1.0915 1.0786
irintensity: 1.6558 0.3081 0.1988 0.3564 0.0468 0.2784 0.2076 0.1370 0.1361 4.4294 1.0024 0.3274 0.5618 6.6527 6.9691 0.2508 0.2368 3.0797 5.4889 5.2006 0.1170 2.6051 0.8683 1.1189 0.5603 0.6419 1.2875 1.5770 1.5374 0.5569 1.8383 0.3050 2.1877 0.9536 1.8060 2.4351 0.0554 0.2036 1.4679 2.0944 2.1193 0.7897 14.5154 12.8700 2.8619 12.8963 0.0099 0.5328 1.4219 10.5546 5.0691 0.0166 23.4890 0.8034 1.3690 6.0005 12.1447 22.2616 4.2983 1.4198 16.7535 6.4168 11.3217 23.0643 8.4837 40.9035 3.1427 60.1583 13.8069 1.4823 41.1807 37.9050 28.5915 5.6255 0.1177 41.0502 2.2718 73.3245 4.2366 26.6039 11.6700 0.8537 5.2975 63.5134 33.9096 85.7322 3.6433 18.8331 10.6686 219.1850 1153.8064 827.3175 7.0716 0.3836 406.4045 312.4073 433.7931 132.4195 55.9022 395.9897 103.0189 32.3125 3.1426 47.4214 512.5373 10.7834 24.7765 66.3083 85.4050 222.5772 31.6383 142.9767 19.9757 7.6663 24.9169 13.3968 156.7286 19.6046 177.1227 0.3313 4.4928 5.3286 11.4501 7.9526 9.8652 39.5304 65.4886 23.0781 172.6010 205.1988 75.1363 301.4678 15.3745 722.3963 45.1944 17.3509 41.8595 46.6637 16.0242 5.0646 58.2629 95.1687 0.7037 4.3245 4.1211 2.2262 0.5066 51.7129 85.8459 26.9175 43.3846 6.4915 17.1420 2.3041 5.8283 16.8048 8.5263 12.0180 79.2033
temp: 298.150 k
press: 1.00000 atm
elementType: 8 8 8 7 7 7 7 7 7 7 6 6 6 6 6 6 6 6 6 6 6 6 6 6 6 6 6 6 6 6 6 6 1 1 1 1 1 1 1 1 1 1 1 1 1 1 1 1 1 1 1 1 1 1 1
symmnumber: 1
zpe: 1108365.2 jmol-1
zpe.correction: 0.422154 hartree
zpe.thermalcorrener: 0.453236 hartree
zpe.thermalcorrenthalpy: 0.454180 hartree
zpe.thermalcorrgfe: 0.356764 hartree
zpe.sumelectzpe: -1458.659754 hartree
zpe.sumelectthermal: -1458.628672 hartree
zpe.sumelectthermalent: -1458.627728 hartree
zpe.sumelectthermalfe: -1458.725145 hartree
dipole: 12.5674 -0.8401 -0.0422
dipole: 12.5955
quadrupole: -200.6452 -203.2279 -186.7510
quadrupole: -22.9563 1.6594 3.1957
quadrupole: -3.7705 -6.3532 10.1237 -22.9563 1.6594 3.1957
hfenergy: -1459.0819082 hartree
pointgroup: C01 [X(C22H23N7O3)]
dipole: -4.9327451 -0.4575924 0.123323 debye
polarizability: 886.5025688|18.005348|376.8145452|-14.5461261|8.664813|147.2616347 unknown
InChI: InChI=1S/C22H23N7O3/c1-4-8-28(9-5-2)18-6-7-20(21(12-18)25-15(3)30)26-27-22-16(13-23)10-19(29(31)32)11-17(22)14-24/h6-7,10-12,25H,4-5,8-9H2,1-3H3
charge 0 multiplicity 1
55 atoms
O  -2.974239 3.545114 0.280128
O  7.59431 1.380735 -0.08731
O  7.942316 -0.872216 -0.268403
N  -4.822362 -0.865079 0.021569
N  -1.022243 2.241534 0.145367
N  0.702851 0.161604 -0.052579
N  1.55715 -0.86303 -0.152889
N  7.17008 0.161306 -0.17458
N  2.049454 3.058892 0.138223
N  2.928775 -4.064134 -0.429262
C  -5.795181 0.236174 0.235958
C  -5.400947 -2.220805 -0.143792
C  -3.460881 -0.633566 -0.009411
C  -6.191325 0.973334 -1.068064
C  -5.498699 -3.013891 1.18364
C  -2.951676 0.701549 0.079541
C  -2.522844 -1.734755 -0.126497
C  -1.570257 0.952043 0.064287
C  -7.204086 2.103393 -0.78803
C  -6.151298 -4.39627 0.972656
C  -0.634977 -0.159132 -0.048961
C  -1.160386 -1.493279 -0.144798
C  -1.708986 3.464317 0.251827
C  2.901795 -0.493698 -0.149905
C  -0.804243 4.683896 0.33161
C  3.451022 0.842981 -0.056196
C  3.829996 -1.594966 -0.252974
C  5.714132 -0.065274 -0.166795
C  4.849373 1.042025 -0.065417
C  5.221663 -1.384161 -0.261382
C  2.623834 2.012423 0.048288
C  3.312974 -2.93502 -0.348183
H  -6.699014 -0.205364 0.696053
H  -5.386326 0.955994 0.967384
H  -6.413812 -2.098784 -0.57074
H  -4.817189 -2.791319 -0.888321
H  -5.284956 1.391692 -1.543016
H  -6.620566 0.243365 -1.782438
H  -4.487127 -3.131668 1.616101
H  -6.086579 -2.425192 1.914629
H  -3.611078 1.564848 0.148338
H  -2.880616 -2.765182 -0.183725
H  -6.770232 2.867162 -0.116751
H  -7.495231 2.609367 -1.725134
H  -8.125549 1.714365 -0.314862
H  -5.567064 -5.014209 0.265353
H  -6.215917 -4.95001 1.925547
H  -7.176976 -4.300576 0.5695
H  -0.44032 -2.31309 -0.223886
H  0.008738 2.28476 0.124339
H  -0.139336 4.748516 -0.546857
H  -0.145777 4.633663 1.216347
H  -1.433941 5.582658 0.389445
H  5.275055 2.046838 0.005387
H  5.922919 -2.218476 -0.339161
