program: Gaussian 09
title: 000092355
version: EM64L-G09RevD.01
frameworkgroup: C1[X(C5H8Br2N2O)]
method: RPBEPBE
basis: SDD
operation: Freq
keyword: #p
keyword: freq=noraman
keyword: PBEPBE/SDD
title: #p freq=noraman PBEPBE/SDD
converged: NO YES NO NO
title: Mulliken charges:
elementType: Br Br O N N C C C C C H H H H H H H H
charge: 0.036278 0.047934 -0.261374 -0.060080 0.063841 -0.441943 -0.458482 -0.349342 -0.382205 -0.384690 0.309349 0.328017 0.253025 0.249172 0.292965 0.266791 0.229364 0.261381
chargesum: 0.00000
title: Mulliken charges with hydrogens summed into heavy atoms:
elementType: Br Br O N N C C C C C
charge: 0.036278 0.047934 -0.261374 -0.060080 0.063841 -0.132594 -0.130465 0.152854 0.177551 0.106055
polarizability: 1.40424260e+02 -4.22700295e+00 1.07747618e+02 -5.21740654e+00 -2.04795040e+00 7.07037200e+01
1716.lowfreq: -6.5148 -0.0004 -0.0004 0.0003 0.0965 9.2038 42.4728 85.0764 103.7383
frequency: 42.4463 85.0725 103.7374 150.8905 170.4635 235.4206 274.3866 294.2213 321.2629 358.8489 367.7125 450.3208 480.3765 639.4411 664.4961 711.4844 797.1001 863.9578 885.4353 938.5083 964.9287 1003.7262 1037.1948 1090.6744 1100.0339 1153.6862 1169.1342 1190.9838 1224.7020 1257.8001 1279.1585 1310.0361 1318.6489 1331.4837 1332.4619 1339.4344 1363.1424 1458.0761 1459.4204 1465.2012 2986.0046 3004.9958 3019.1310 3060.1723 3079.0337 3084.1394 3090.6616 3095.7089
redmass: 10.2062 5.1974 39.1303 3.8841 8.4489 7.8804 5.0748 3.9310 3.0222 3.4891 3.0272 4.1258 4.1435 5.1646 3.5267 2.6008 3.4651 2.7888 2.1218 2.4529 2.5975 2.0433 3.3092 1.8477 3.1764 1.1790 1.2517 1.6201 1.8307 1.6486 1.2354 1.5007 1.3343 1.4332 1.8422 1.2287 2.8834 1.0790 1.0843 1.0868 1.0664 1.0615 1.0609 1.0873 1.0944 1.0976 1.0992 1.0964
irintensity: 4.4602 2.9814 0.2041 2.2785 0.0739 4.2173 5.0482 5.3704 3.7771 5.7699 2.1662 7.0158 11.6196 4.4530 30.5063 22.3182 7.8288 39.1943 18.6084 169.3695 0.3760 25.5969 11.1441 33.4639 0.6210 2.2216 33.0159 16.0327 10.3270 31.0517 6.7021 65.6513 6.3356 12.8419 43.6110 1.7356 81.7368 22.4828 6.7030 13.3488 34.2319 13.0857 9.2959 2.6913 6.1624 9.6401 5.9484 14.0419
temp: 298.150 k
press: 1.00000 atm
elementType: 35 35 8 7 7 6 6 6 6 6 1 1 1 1 1 1 1 1
symmnumber: 1
zpe: 347547.2 jmol-1
zpe.correction: 0.132374 hartree
zpe.thermalcorrener: 0.142732 hartree
zpe.thermalcorrenthalpy: 0.143676 hartree
zpe.thermalcorrgfe: 0.093845 hartree
zpe.sumelectzpe: -406.134214 hartree
zpe.sumelectthermal: -406.123856 hartree
zpe.sumelectthermalent: -406.122912 hartree
zpe.sumelectthermalfe: -406.172742 hartree
dipole: -0.5869 -2.3616 2.7673
dipole: 3.6851
quadrupole: -100.0756 -76.1942 -76.0090
quadrupole: -3.5857 7.8971 -1.2306
quadrupole: -15.9827 7.8988 8.0839 -3.5857 7.8971 -1.2306
hfenergy: -406.2665876 hartree
pointgroup: C01 [X(C5H8Br2N2O1)]
dipole: -0.3073824 -1.0356662 0.9668864 debye
dipolederiv: -0.5911972 -0.1047235 -0.1147011 -0.1123352 -0.1433043 -0.018097 -0.2160676 -0.0349377 -0.1616949 -0.3135938 0.2291021 0.0391061 0.2729543 -0.4985377 -0.0256979 0.0647078 -0.0810055 -0.1044506 -0.6498525 -0.0482772 0.1806678 -0.9412055 -0.5009674 0.4131011 0.3962145 0.099619 -0.3525284 -0.9613926 -0.1958571 0.3027349 0.0320976 -0.1628123 -0.0448559 0.1764157 0.1922253 -0.3733591 1.1313137 0.2897569 -0.6242524 0.8410987 0.0873974 -0.3384988 -0.7870063 -0.2249917 0.3066103 0.7826129 0.3752036 0.2472138 0.1305733 0.0227586 0.0340969 0.3065064 -0.0086002 0.2023545 0.2994055 -0.4704839 -0.1235008 -0.2719239 0.7198298 0.0751829 -0.1766376 0.0288288 0.0437951 -0.0909371 -0.1064165 -0.057706 -0.0800895 -0.0340286 -0.0208689 -0.1337409 0.0917398 0.038092 0.024322 -0.0857184 0.0570974 -0.2222789 -0.032447 0.0828106 0.2712483 0.0508969 0.221491 0.1567907 0.1399741 -0.0028316 0.3076265 0.3547874 -0.0828121 0.0999418 -0.1296806 0.3540662 -0.0298446 -0.0371764 -0.0703637 0.0024776 0.0373956 -0.0364208 -0.0190373 -0.0153147 -0.085346 0.0162634 0.0547448 0.034093 0.0275816 -0.0217568 -0.0707771 0.0125296 -0.0076436 -0.0284022 0.0497918 0.0153284 0.0077626 0.020262 0.0977232 0.0117535 0.0148163 -0.040157 -0.0862334 0.0149796 -0.0633959 0.0389934 -0.046497 -0.0854617 0.0527017 0.027465 0.0647023 0.0685833 0.0902371 -0.0836284 0.0027559 0.0203165 0.0380227 0.0047637 -0.0401219 0.0435329 0.0945837 0.0358433 0.0448747 0.0429322 0.0754839 0.0916245 -0.0019714 -0.0136768 -0.0363684 -0.0821669 0.0502585 -0.0625452 0.0458822 -0.0803004 0.0268617 -0.0301143 0.0041062 0.0542725 -0.1521577 -0.0150007 0.109238 -0.0058838 0.0241584 0.0029149 -0.0042962 0.0123368 -0.0471179 0.096763 unknown
polarizability: 140.6217456|-4.5357232|107.9510371|-1.9246734|1.8923747|70.3028159 unknown
InChI: InChI=1S/C5H8Br2N2O/c6-4-1-2-9(8-10)3-5(4)7/h4-5H,1-3H2
charge 0 multiplicity 1
18 atoms
Br -3.313478 -0.803539 -0.685895
Br -1.958158 2.458432 0.194121
O  2.976268 0.846756 -0.868989
N  1.325957 -0.229519 0.229923
N  2.544809 -0.283357 -0.439913
C  -1.539614 -0.47833 0.258275
C  -0.866285 0.804412 -0.250871
C  -0.637349 -1.712025 0.020431
C  0.524308 0.998433 0.404868
C  0.753217 -1.507899 0.67512
H  -1.821775 -0.377499 1.320485
H  -0.79504 0.807157 -1.350469
H  -0.51683 -1.877688 -1.065464
H  -1.123054 -2.607869 0.444623
H  1.074341 1.828189 -0.071089
H  0.40823 1.219042 1.482583
H  0.663273 -1.509093 1.779521
H  1.452481 -2.307402 0.379738
