program: Gaussian 09
title: 000092368
version: EM64L-G09RevD.01
frameworkgroup: C1[X(C9H18N6O3)]
method: RPBEPBE
basis: SDD
operation: Freq
keyword: #p
keyword: freq=noraman
keyword: PBEPBE/SDD
title: #p freq=noraman PBEPBE/SDD
converged: YES YES NO NO
title: Mulliken charges:
elementType: O O O N N N N N N C C C C C C C C C H H H H H H H H H H H H H H H H H H
charge: -0.422789 -0.422487 -0.422614 -0.119879 -0.120074 -0.120250 -0.147657 -0.146574 -0.146925 0.149752 0.149159 0.148866 -0.368615 -0.367450 -0.367198 -0.623233 -0.622442 -0.622505 0.277908 0.202872 0.277166 0.202409 0.276963 0.202491 0.202933 0.257936 0.251414 0.257479 0.251486 0.202788 0.251479 0.202886 0.257635 0.339224 0.338919 0.338928
chargesum: 0.00000
title: Mulliken charges with hydrogens summed into heavy atoms:
elementType: O O O N N N N N N C C C C C C C C C
charge: -0.083565 -0.083568 -0.083685 -0.119879 -0.120074 -0.120250 -0.147657 -0.146574 -0.146925 0.149752 0.149159 0.148866 0.112165 0.112125 0.112255 0.089050 0.089311 0.089494
polarizability: 1.99490177e+02 2.84998436e-02 1.99292593e+02 6.57937269e-02 9.83189332e-02 1.01027879e+02
1716.lowfreq: -7.2845 -1.2281 -0.0011 -0.0010 -0.0009 5.5655 40.4230 43.2855 46.5560
frequency: 40.3676 43.2699 46.5476 54.7736 64.1030 67.5599 92.9671 98.2018 103.8652 122.2384 131.8353 134.0133 167.0930 170.5520 215.3112 216.1684 225.1707 265.5625 292.6728 293.3069 296.5917 342.5904 343.8193 345.0543 427.8924 429.1899 469.5601 502.5364 503.7488 589.4853 589.8876 608.4775 672.6672 709.9532 710.3670 791.8097 832.9013 833.0274 897.9982 904.0586 905.6638 906.4293 939.0808 978.3671 978.6817 1013.2163 1038.4568 1039.0376 1109.9285 1113.2193 1113.8014 1122.6163 1134.3947 1134.9424 1220.5093 1220.9450 1243.8700 1264.1479 1278.6915 1284.6762 1284.8700 1321.8888 1322.4979 1323.4211 1398.3708 1399.9557 1401.0973 1412.4884 1413.0930 1428.9342 1440.3754 1440.6664 1445.3146 1448.5863 1449.2452 1453.5962 1454.7945 1455.7383 1488.2914 1493.2367 1493.5082 1510.4740 1510.9112 1571.0194 2979.4356 2979.7171 2979.9046 2984.1179 2984.1987 2985.2735 3067.4722 3068.1498 3068.2734 3098.8949 3099.1197 3099.8525 3144.7785 3145.3740 3145.4061 3552.3806 3552.9864 3553.0671
redmass: 4.9183 4.9207 5.9074 2.9250 3.5410 3.6904 1.6238 1.6578 1.3596 1.5144 4.2103 3.7327 1.9841 1.9467 7.1780 6.8141 5.5625 1.9354 1.2616 1.2610 1.8462 2.7252 2.6878 1.8950 3.1620 3.1823 4.0200 3.8106 3.7790 5.5369 5.5551 4.1518 5.7197 10.9766 10.9776 11.9526 4.9474 4.9436 5.7275 5.5128 6.3240 6.3986 3.2492 1.6963 1.7011 1.6505 1.8923 1.8975 1.4872 1.3467 1.3477 1.4128 1.8236 1.8265 2.1599 2.1473 2.1752 6.5401 2.9896 3.1082 3.1012 1.2656 1.2699 1.1828 1.1863 1.2029 1.1556 1.6855 1.7289 1.2094 1.4314 1.4202 1.0857 1.1478 1.1659 1.0869 1.3593 1.3209 1.1016 1.4925 1.4719 2.0624 2.1468 4.4617 1.0452 1.0489 1.0473 1.0566 1.0575 1.0570 1.0999 1.0999 1.0998 1.1006 1.1007 1.1003 1.0953 1.0954 1.0953 1.0664 1.0663 1.0663
irintensity: 0.2225 0.4059 0.5720 10.5562 1.4122 1.2011 3.3449 3.3690 3.8959 0.3212 0.2778 0.1978 11.7722 11.0902 2.3735 2.3221 0.3190 12.6634 166.1511 167.5805 6.7292 27.6644 28.5119 0.9898 58.6144 56.5238 23.3725 36.5130 37.4317 44.2313 44.4987 4.8300 3.3135 8.2404 8.1245 17.6069 46.7041 45.4317 163.3085 115.7696 189.8495 195.1850 82.4741 19.5956 19.5005 18.6434 114.0429 115.9959 21.5282 23.8491 24.0573 9.2904 1.7823 1.9483 174.0370 172.5245 4.8731 14.7066 31.2339 79.8993 78.8619 5.9307 6.3692 6.6972 66.7111 86.3372 42.7286 100.5135 109.1552 6.3505 63.2264 70.2831 6.6754 8.1056 7.3390 25.0038 63.2208 65.2572 1.0058 177.9883 166.1592 1057.9296 1091.2324 0.0454 34.4415 35.8957 48.3554 134.8400 147.5625 50.3112 30.3310 25.4376 38.9524 16.2193 19.7659 18.1652 2.5947 2.1138 3.2430 6.0456 5.7242 6.7446
temp: 298.150 k
press: 1.00000 atm
elementType: 8 8 8 7 7 7 7 7 7 6 6 6 6 6 6 6 6 6 1 1 1 1 1 1 1 1 1 1 1 1 1 1 1 1 1 1
symmnumber: 1
zpe: 762850.5 jmol-1
zpe.correction: 0.290554 hartree
zpe.thermalcorrener: 0.311410 hartree
zpe.thermalcorrenthalpy: 0.312354 hartree
zpe.thermalcorrgfe: 0.239556 hartree
zpe.sumelectzpe: -906.501871 hartree
zpe.sumelectthermal: -906.481015 hartree
zpe.sumelectthermalent: -906.480071 hartree
zpe.sumelectthermalfe: -906.552869 hartree
dipole: 0.0239 -0.0160 -2.5714
dipole: 2.5715
quadrupole: -91.9370 -91.7874 -111.1153
quadrupole: 0.0026 -0.0145 0.1086
quadrupole: 6.3429 6.4925 -12.8354 0.0026 -0.0145 0.1086
hfenergy: -906.792425 hartree
pointgroup: C01 [X(C9H18N6O3)]
dipole: -0.0079841 -0.0321449 -1.0111765 debye
polarizability: 199.3423807|-0.1010978|199.394994|-0.4570765|-2.066007|101.0732734 unknown
InChI: InChI=1S/C9H18N6O3/c1-13(4-16)7-10-8(14(2)5-17)12-9(11-7)15(3)6-18/h16-18H,4-6H2,1-3H3
charge 0 multiplicity 1
36 atoms
O  -4.131012 0.246088 1.303367
O  1.897833 -3.667782 1.340159
O  2.246331 3.515047 1.181634
N  -2.482481 1.114774 -0.306099
N  0.262038 -2.715804 -0.235762
N  2.208415 1.574852 -0.335236
N  -1.142604 -0.833988 -0.253147
N  -0.150181 1.390733 -0.307389
N  1.280904 -0.58105 -0.266276
C  -1.219353 0.537963 -0.285457
C  0.130808 -1.333449 -0.249247
C  1.076659 0.770896 -0.299109
C  -3.678801 0.306511 -0.097227
C  1.566229 -3.344161 -0.057833
C  2.104776 3.023368 -0.199714
C  -2.601171 2.584612 -0.296124
C  -0.951525 -3.551778 -0.179789
C  3.539758 0.942585 -0.282299
H  -3.441144 -0.733873 -0.350036
H  -4.486097 0.70634 -0.743659
H  2.340031 -2.628015 -0.359914
H  1.598021 -4.260742 -0.681126
H  1.092436 3.327505 -0.49196
H  2.871128 3.488706 -0.85217
H  -3.659302 2.850731 -0.468759
H  -1.982525 3.025038 -1.094183
H  -2.261633 3.020971 0.661774
H  -1.65733 -3.257463 -0.973009
H  -1.480532 -3.449227 0.785942
H  -0.656547 -4.605691 -0.329055
H  3.732575 0.466084 0.696866
H  4.303026 1.717985 -0.472686
H  3.622294 0.157386 -1.050777
H  -4.436838 1.143581 1.59286
H  1.28205 -4.369067 1.674717
H  3.166764 3.338135 1.504722
