program: Gaussian 09
title: 000092339
version: EM64L-G09RevD.01
frameworkgroup: C1[X(C12H8Cl2O)]
method: RPBEPBE
basis: SDD
operation: Freq
keyword: #p
keyword: freq=noraman
keyword: PBEPBE/SDD
title: #p freq=noraman PBEPBE/SDD
converged: YES YES NO NO
title: Mulliken charges:
elementType: Cl Cl O C C C C C C C C C C C C H H H H H H H H
charge: -0.010657 -0.046448 -0.284666 0.468065 0.353831 -0.308034 -0.319868 -0.360563 -0.382320 -0.194360 -0.208204 -0.111167 -0.201818 -0.191978 -0.247999 0.278167 0.266477 0.261624 0.282047 0.260163 0.231644 0.232989 0.233073
chargesum: 0.00000
title: Mulliken charges with hydrogens summed into heavy atoms:
elementType: Cl Cl O C C C C C C C C C C C C
charge: -0.010657 -0.046448 -0.284666 0.468065 0.353831 -0.308034 -0.041701 -0.094086 -0.120696 0.087688 0.051959 -0.111167 0.029827 0.041011 -0.014926
polarizability: 2.29135190e+02 -1.62458744e+00 1.41435703e+02 1.01850995e+01 -7.47348837e+00 8.65227122e+01
1716.lowfreq: -7.7035 -5.7556 -0.0001 0.0019 0.0030 2.8765 24.2725 41.5122 57.4740
frequency: 24.1524 41.4797 57.4735 126.7256 159.0990 165.3187 189.3321 238.5479 300.7499 316.3876 371.7896 410.0346 423.7383 439.1763 443.8606 487.7768 539.7391 600.9126 606.2498 637.6513 677.2508 689.6272 710.2994 760.7831 773.2780 811.7086 837.3471 858.3917 861.6973 909.0315 943.4061 970.5215 987.0446 990.0230 1019.5122 1029.1663 1077.7640 1080.8132 1142.1259 1158.3393 1171.2784 1184.5145 1232.5583 1248.0392 1308.3648 1356.1770 1382.1865 1386.1031 1441.7316 1454.6552 1472.0095 1570.5601 1587.1221 1596.3780 1609.7807 3133.6868 3142.9036 3156.6139 3159.2463 3166.5330 3176.9467 3180.0271 3183.3703
redmass: 6.2976 4.6109 7.1883 6.9695 12.0447 6.1547 7.1870 7.5068 6.5480 8.7686 9.7287 2.9304 6.2833 4.2805 5.2426 3.4242 4.7299 6.1333 6.3874 7.3666 5.7938 2.5803 3.5359 2.0161 3.7368 1.4382 1.2516 6.0571 1.4055 1.4096 1.3353 1.3623 6.2706 1.3033 2.1550 3.9354 1.5230 2.4505 1.3718 1.8148 1.0887 1.4639 3.1648 1.5226 1.3448 4.8793 5.7348 7.8807 2.3049 2.5890 2.2704 7.9520 7.4009 6.4356 6.7906 1.0852 1.0890 1.0929 1.0892 1.0968 1.1003 1.0963 1.0940
irintensity: 1.3238 0.0605 0.1535 1.4188 0.1453 0.4679 0.5762 0.4009 3.5030 5.3512 1.6965 0.6943 2.5718 10.0218 4.0537 22.3929 8.5044 2.4886 2.0571 7.4262 13.0354 28.6483 12.7673 129.6531 21.9835 32.4276 2.3947 23.3731 19.8719 4.9529 0.2316 0.2068 2.8520 0.4014 6.7462 83.8324 16.6412 57.0654 3.3467 46.1028 2.7412 6.3486 291.8869 99.7233 1.3995 12.0482 3.5860 2.6637 15.0064 344.4177 82.5195 26.8242 28.7472 21.8874 33.7728 1.9627 9.2712 26.6263 0.6381 14.0080 7.3613 0.4207 0.8726
temp: 298.150 k
press: 1.00000 atm
elementType: 17 17 8 6 6 6 6 6 6 6 6 6 6 6 6 1 1 1 1 1 1 1 1
symmnumber: 1
zpe: 425685.8 jmol-1
zpe.correction: 0.162135 hartree
zpe.thermalcorrener: 0.175016 hartree
zpe.thermalcorrenthalpy: 0.175960 hartree
zpe.thermalcorrgfe: 0.120407 hartree
zpe.sumelectzpe: -1456.359902 hartree
zpe.sumelectthermal: -1456.347021 hartree
zpe.sumelectthermalent: -1456.346077 hartree
zpe.sumelectthermalfe: -1456.401630 hartree
dipole: -2.3308 -2.1685 -0.0393
dipole: 3.1838
quadrupole: -94.4440 -99.9699 -99.1270
quadrupole: 5.7214 1.8160 -2.2133
quadrupole: 3.4029 -2.1229 -1.2801 5.7214 1.8160 -2.2133
hfenergy: -1456.5220368 hartree
pointgroup: C01 [X(C12H8Cl2O1)]
dipole: -0.915852 -0.8409913 0.1514914 debye
dipolederiv: -0.0939442 0.0794488 -0.0052029 0.0855157 -0.7180032 0.0128131 0.0024184 0.0020708 -0.0333898 -0.8174053 0.2345728 -0.0702866 0.2518574 -0.2141193 0.021705 -0.1059731 0.0318453 -0.0689928 -2.389591 -0.1221715 0.1001512 -0.2431326 -0.2900203 0.0801399 -0.251073 0.0571 -0.2214291 1.6896529 -0.054876 -0.0014382 -0.5328813 -0.1699863 0.0355268 0.4558887 0.0318641 0.0874152 1.612235 0.2748246 -0.1711128 0.825694 0.1790496 -0.1129791 -0.2333509 -0.0708795 0.2019825 -0.1421143 -0.1000518 0.0398766 -0.1382711 1.10505 -0.0250953 0.0294333 -0.0167102 -0.0896276 -0.2241468 -0.1084455 0.0266823 0.259286 0.0247257 0.0016395 -0.0539464 -0.0104322 -0.1414211 -0.2706746 -0.0002799 0.0441225 -0.1889688 -0.1693207 0.0016629 0.2671328 0.0259632 -0.118495 -0.4179657 -0.0331822 0.0606999 0.002219 -0.0974452 -0.0800693 -0.0443265 -0.0983176 -0.0124543 -0.2359955 0.1162095 -0.018997 0.124058 -0.2592524 0.0206448 -0.0204864 0.0160828 -0.0532605 -0.1971203 0.134084 -0.0044076 0.032865 0.001887 0.008759 -0.0051946 0.0177336 -0.1008059 1.0872682 -0.3684585 0.1326334 -0.369661 0.2225856 -0.0462361 0.1569131 -0.0543517 -0.0682988 0.0931113 0.0417974 0.0465704 0.0813171 -0.0571816 -0.106914 -0.0109159 -0.1165828 0.0927187 0.1322839 0.0434215 0.0482917 0.0473184 -0.0869297 -0.086885 0.0823486 -0.0722607 0.0496641 -0.0521396 0.0799953 -0.0503456 0.0468256 -0.1344103 -0.0349619 -0.0356699 -0.0375937 -0.1507601 0.0294001 -0.0506981 -0.0316457 -0.0935547 0.0385482 0.0001189 -0.0557535 0.0030253 0.1455471 0.0073269 -0.009644 -0.0863162 -0.0196609 0.1233185 0.028433 -0.1336918 0.0162591 0.0710879 0.1267036 -0.0340405 0.0185221 -0.029754 0.1122108 0.0893408 0.0157539 0.0837375 0.0076386 0.0507291 -0.0435249 -0.0135287 -0.04004 0.0692291 -0.0074946 -0.0205024 -0.0037993 0.1668418 0.0785503 0.0261599 -0.0045455 0.0365166 -0.0243778 -0.0044545 -0.0004652 0.0032445 0.1657509 0.0688913 -0.0183365 0.0033959 -0.0331169 0.0953657 0.1088946 0.0341198 0.1054569 -0.0515972 -0.0559048 -0.0004585 -0.1011835 -0.0058188 0.1351842 0.0403554 -0.1123835 0.0362229 0.0299216 -0.0791502 -0.0863459 0.0380639 -0.098613 0.1138924 0.0550561 0.0397244 0.0503218 0.0919639 unknown
polarizability: 229.3064284|0.130074|136.8082951|9.087355|-16.9901716|90.9788824 unknown
InChI: InChI=1S/C12H8Cl2O/c13-9-6-7-12(11(14)8-9)15-10-4-2-1-3-5-10/h1-8H
charge 0 multiplicity 1
23 atoms
Cl 1.512425 3.044564 -0.197848
Cl 5.042004 -1.22234 0.223946
O  -0.541559 0.91899 -0.580809
C  0.722528 0.363835 -0.329998
C  -1.730814 0.249399 -0.175872
C  1.810336 1.259354 -0.178861
C  0.975894 -1.029672 -0.322265
C  -1.841232 -0.419312 1.06474
C  -2.837279 0.384754 -1.040163
C  3.126688 0.788089 -0.013169
C  2.287188 -1.520687 -0.152217
C  3.344191 -0.603092 0.001784
C  -3.088126 -0.974068 1.429904
C  -4.078034 -0.171391 -0.658111
C  -4.207821 -0.855857 0.57338
H  0.145406 -1.728227 -0.459685
H  -0.980242 -0.491558 1.73685
H  -2.713023 0.923046 -1.984312
H  3.954203 1.491756 0.104709
H  2.479209 -2.596883 -0.14988
H  -3.184095 -1.489926 2.391558
H  -4.941742 -0.069375 -1.323924
H  -5.171404 -1.286201 0.865243
