program: Gaussian 09
title: 000092346
version: EM64L-G09RevD.01
frameworkgroup: C1[X(C12H8Cl2O)]
method: RPBEPBE
basis: SDD
operation: Freq
keyword: #p
keyword: freq=noraman
keyword: PBEPBE/SDD
title: #p freq=noraman PBEPBE/SDD
converged: YES YES NO NO
title: Mulliken charges:
elementType: Cl Cl O C C C C C C C C C C C C H H H H H H H H
charge: -0.037181 -0.052749 -0.436791 0.370454 0.474995 -0.518104 -0.407740 -0.364192 -0.339022 0.301880 -0.187243 -0.114494 -0.202694 -0.406538 -0.229511 0.273047 0.282838 0.258158 0.228830 0.261097 0.224605 0.263749 0.356609
chargesum: 0.00000
title: Mulliken charges with hydrogens summed into heavy atoms:
elementType: Cl Cl O C C C C C C C C C C C C
charge: -0.037181 -0.052749 -0.080183 0.370454 0.474995 -0.245057 -0.149582 -0.364192 -0.056184 0.301880 0.041587 -0.114494 0.058402 -0.181933 0.034238
polarizability: 2.19453574e+02 -3.39875703e+00 1.61630323e+02 -7.01369627e+00 9.10583678e+00 7.88730721e+01
1716.lowfreq: -5.7590 -0.0021 -0.0018 -0.0015 6.4170 9.0735 37.7849 74.5351 81.9090
frequency: 37.6833 74.5343 81.9063 97.4059 176.6517 218.3882 234.6686 238.9105 295.1096 310.2306 316.4940 357.4380 390.3145 413.8024 462.5655 463.9829 512.7599 518.4382 572.9838 613.6749 623.9509 677.7294 695.4563 718.9944 754.3624 784.0022 809.3224 874.9641 880.7732 884.0651 904.5943 944.3109 966.6989 983.8731 1006.8842 1060.5647 1087.3963 1092.6952 1131.6539 1145.9373 1181.8574 1214.5377 1247.7172 1287.6140 1300.3512 1350.0497 1377.8813 1390.3915 1439.4191 1464.4730 1488.3693 1554.4953 1587.8167 1595.3851 1627.2369 3118.9612 3148.4216 3159.3664 3164.3706 3168.0767 3174.9440 3184.0999 3584.2874
redmass: 7.0835 5.5124 5.8737 10.7575 13.2632 5.6804 4.5590 6.4897 8.7850 6.6095 14.3074 1.1141 4.5500 3.5980 3.4946 3.6309 6.5233 7.0552 5.2131 5.6212 5.7334 6.9742 2.2613 3.4336 8.1021 1.5761 1.3436 1.4509 1.7661 2.2907 1.7593 1.3432 1.3276 6.1389 5.5814 3.1149 1.8293 1.7312 1.4279 1.3673 1.0863 1.8591 1.4153 2.5257 1.3687 4.9423 5.1210 5.6881 2.5041 2.7926 3.1133 6.5728 6.4669 8.2675 6.3020 1.0890 1.0917 1.0922 1.0889 1.0922 1.0973 1.0978 1.0661
irintensity: 0.1104 2.6757 1.1783 0.1187 0.9180 2.4737 0.0674 1.4107 0.6175 0.1070 0.3623 141.5656 6.6784 2.8571 1.4673 18.0139 36.6896 3.6250 6.9214 1.4824 3.9025 0.2425 31.3267 5.7040 29.1258 45.5058 41.2765 20.7658 25.7771 39.4590 3.9114 0.0507 0.6105 3.4951 81.1599 8.2039 36.0018 19.4490 6.1750 192.5448 2.4162 4.1790 4.0458 45.1168 20.6548 8.6113 19.1878 8.8317 84.0502 32.6314 21.8366 17.4937 70.1224 16.8027 45.5012 12.8930 18.0340 2.0723 0.6097 0.2637 6.7325 1.5016 41.3978
temp: 298.150 k
press: 1.00000 atm
elementType: 17 17 8 6 6 6 6 6 6 6 6 6 6 6 6 1 1 1 1 1 1 1 1
symmnumber: 1
zpe: 426027.8 jmol-1
zpe.correction: 0.162265 hartree
zpe.thermalcorrener: 0.175236 hartree
zpe.thermalcorrenthalpy: 0.176180 hartree
zpe.thermalcorrgfe: 0.121602 hartree
zpe.sumelectzpe: -1456.377335 hartree
zpe.sumelectthermal: -1456.364364 hartree
zpe.sumelectthermalent: -1456.363420 hartree
zpe.sumelectthermalfe: -1456.417998 hartree
dipole: -2.0796 0.5119 0.8442
dipole: 2.3021
quadrupole: -78.3407 -102.5098 -103.6230
quadrupole: 10.2465 -4.3397 1.3959
quadrupole: 16.4838 -7.6853 -8.7985 10.2465 -4.3397 1.3959
hfenergy: -1456.5396008 hartree
pointgroup: C01 [X(C12H8Cl2O1)]
dipole: -0.7729469 0.1115978 0.4586788 debye
dipolederiv: -0.2324358 0.2277943 0.0578058 0.2041296 -0.6162152 -0.1519543 0.0753741 -0.1493254 -0.0907145 -0.3726965 0.2749785 0.1118556 0.3925779 -0.5776571 -0.1843833 0.1423987 -0.1750459 -0.1286346 -0.5898617 -0.2692466 -0.5200338 -0.3733493 -0.5999759 -0.267007 -0.706478 -0.2849584 -0.8062294 0.2344904 0.0719981 0.0396031 -0.01286 0.0002921 0.104279 -0.0514285 0.0435432 0.174536 0.4058471 0.1516035 -0.0151842 0.0586283 -0.1133266 -0.0614187 -0.0689738 -0.0487044 0.0067264 -0.3066577 -0.1400576 -0.2784262 0.053863 -0.1626259 -0.0321174 0.0090026 0.021001 -0.0884794 -0.2908534 0.03042 0.1162877 -0.0314251 -0.1185333 0.0609379 0.0462841 0.0152428 -0.124054 0.1073205 -0.4122843 -0.0914671 -0.339179 0.8353934 0.2320213 -0.0746259 0.2538381 -0.0250396 -0.3021085 0.0660711 0.0384085 0.1881035 -0.1659778 -0.057041 0.053293 -0.033266 -0.117168 0.579422 0.3202435 0.5173764 0.3900229 0.3202468 0.3742346 0.7181332 0.3974582 0.6925363 0.1868865 0.0019862 -0.103982 0.089057 -0.0637923 0.0802925 0.0286524 0.1030332 0.093529 0.486235 -0.4346628 -0.1899895 -0.6124004 0.8378329 0.3176539 -0.196579 0.3081269 0.0507348 -0.0217459 0.0841614 0.0051291 0.10565 -0.1224585 -0.0087686 -0.0097865 -0.01637 -0.0880902 -0.0599036 0.0499285 0.0548791 -0.1094605 -0.2356038 -0.0212888 -0.2868895 -0.0719394 -0.2785698 -0.1296848 0.1031596 0.030092 0.1117986 -0.2089338 -0.036325 0.0292486 -0.0418077 -0.13166 0.0865889 0.0209811 0.0687837 0.0196628 0.1323462 -0.0555844 0.0749748 -0.0439119 0.0205721 0.0903373 -0.0492098 -0.0059527 -0.0690308 0.0185799 -0.0199375 -0.0047805 -0.034913 0.1373008 0.0553581 -0.0441418 -0.0702337 -0.0336678 0.1050685 -0.0779796 -0.0778045 -0.0576955 0.0358622 0.0211163 0.0130941 0.0805256 0.0237333 0.118719 -0.077387 0.0930356 -0.072121 -0.0404618 0.0537881 -0.0370377 0.0026801 -0.058249 -0.0070508 -0.0388332 -0.0021263 -0.0381784 0.1511404 -0.1359891 -0.0507741 0.005272 -0.065398 0.1475219 -0.0375032 -0.0166672 -0.038741 0.098377 -0.0319242 -0.0012859 0.0236473 0.005976 0.0969996 -0.0197311 0.0310734 -0.0239161 0.1603011 0.1664711 0.0222807 0.1229231 0.0618169 0.3791506 -0.0221591 0.1946691 -0.0113492 0.2974849 unknown
polarizability: 217.0402778|-3.3771394|140.4164437|-15.2236957|38.5786261|102.5002472 unknown
InChI: InChI=1S/C12H8Cl2O/c13-9-4-5-12(14)11(7-9)8-2-1-3-10(15)6-8/h1-7,15H
charge 0 multiplicity 1
23 atoms
Cl 0.600568 2.934791 0.793657
Cl 3.707266 -2.395619 -1.009764
O  -3.616336 -1.372276 -1.676904
C  -0.799347 0.05604 0.259862
C  0.680901 0.184111 0.098848
C  -1.552075 -0.576063 -0.759896
C  -1.46084 0.503904 1.436173
C  1.426372 1.37016 0.335635
C  1.418951 -0.960078 -0.321923
C  -2.945521 -0.747469 -0.611055
C  -2.851619 0.320549 1.575853
C  2.812713 -0.898721 -0.479325
C  2.825892 1.427321 0.178765
C  -3.607697 -0.30224 0.557537
C  3.539724 0.280413 -0.230277
H  -1.079102 -0.914144 -1.687191
H  0.885283 -1.898797 -0.495882
H  -0.889109 0.97819 2.238114
H  -3.354662 0.661019 2.487157
H  3.356192 2.365415 0.364324
H  -4.691013 -0.436244 0.673045
H  4.625333 0.31263 -0.353654
H  -4.586375 -1.438591 -1.4946
