program: Gaussian 09
title: 000092387
version: EM64L-G09RevD.01
frameworkgroup: C1[X(C15H21NO2S)]
method: RPBEPBE
basis: SDD
operation: Freq
keyword: #p
keyword: freq=noraman
keyword: PBEPBE/SDD
title: #p freq=noraman PBEPBE/SDD
converged: YES YES NO NO
title: Mulliken charges:
elementType: S O O N C C C C C C C C C C C C C C C H H H H H H H H H H H H H H H H H H H H H
charge: 0.220997 -0.245258 -0.209441 -0.129920 0.280101 -0.344487 -0.356659 -0.757374 -0.807117 -0.340887 -0.318179 0.075596 0.300470 -0.378705 -0.315775 -0.169189 -0.278035 -0.219093 -0.860470 0.240434 0.189582 0.180419 0.222365 0.223156 0.236159 0.228054 0.253979 0.245689 0.225132 0.207275 0.207802 0.192364 0.207092 0.279833 0.224195 0.242368 0.243657 0.268578 0.270208 0.265084
chargesum: 0.00000
title: Mulliken charges with hydrogens summed into heavy atoms:
elementType: S O O N C C C C C C C C C C C C C C C
charge: 0.220997 -0.245258 -0.209441 -0.129920 0.280101 0.085528 0.046126 -0.070004 -0.082318 0.074191 0.081277 0.075596 0.300470 -0.098872 -0.091580 0.073179 -0.034378 -0.219093 -0.056600
polarizability: 3.23686871e+02 4.72658270e+00 1.77955968e+02 -7.79241610e+00 5.10249761e+00 1.20992644e+02
1716.lowfreq: -15.6870 -6.0837 -1.2778 -0.0010 0.0015 0.0015 15.7293 37.2385 52.4258
frequency: 14.9035 37.1175 52.3664 55.1045 82.3239 99.5379 115.6562 132.2038 162.1167 167.2743 201.4654 220.3531 229.5217 248.4322 260.8016 271.0711 299.5063 310.3507 316.0231 336.3423 363.3003 390.9088 399.1919 415.2118 442.1356 466.0915 483.1645 492.1907 526.6526 590.9446 626.3592 631.3373 670.2588 689.2582 698.1640 736.8275 754.2431 806.9188 829.4814 845.9600 847.6180 872.6009 909.4906 916.1759 934.0868 961.2094 963.5925 967.3994 988.0466 994.5944 1004.2457 1006.5024 1025.5019 1051.0186 1075.4903 1079.3174 1081.2322 1103.4822 1122.8982 1130.9863 1148.3284 1166.8578 1186.2373 1197.1881 1208.6998 1244.5645 1260.7028 1275.7966 1300.9011 1302.8928 1334.3482 1345.1142 1345.8954 1355.1878 1366.2527 1374.5256 1378.9180 1392.5369 1413.7028 1442.0628 1443.7228 1450.3891 1454.0866 1455.9100 1461.3093 1466.9678 1471.4690 1475.7622 1483.2002 1489.2019 1535.7883 1567.4269 1603.7999 2854.3021 2880.0452 2955.4478 2972.0117 2990.9774 2995.6205 3010.5655 3064.4341 3072.9578 3077.5672 3079.8309 3085.9303 3090.7880 3110.8759 3114.4150 3129.6180 3136.2345 3137.3409 3145.9610 3164.9056 3182.1116
redmass: 4.8709 3.6882 2.9090 4.8861 4.4096 3.2000 3.6211 1.4171 3.3251 4.2513 1.7801 1.6593 1.7267 1.3717 3.4177 2.7402 3.1697 4.1175 3.4567 3.4006 3.6733 2.9615 3.2003 2.9480 2.9244 2.7893 5.9653 3.2850 3.6457 3.2658 3.4397 4.8396 7.1165 4.2349 3.9102 3.9374 3.7322 4.2263 1.4001 1.6266 1.4584 2.7486 2.0422 1.6972 3.9660 1.5756 1.8837 1.2271 1.4049 1.3642 1.4911 2.0971 2.2149 2.0745 2.3810 3.4283 3.6034 2.1236 4.1011 1.3943 2.9173 2.3130 2.1248 1.1780 1.2377 3.0900 1.4313 1.3045 1.2808 1.2871 1.2538 1.3258 1.3598 2.3239 1.3305 1.2876 1.2094 1.2153 4.0457 1.0821 1.0898 1.0964 1.0522 1.1022 1.0822 1.0714 1.0532 1.7730 1.0898 1.1034 7.9162 7.6455 6.5096 1.0703 1.0700 1.0657 1.0643 1.0378 1.0374 1.0290 1.0882 1.0968 1.0988 1.1005 1.0882 1.0997 1.0963 1.0966 1.1063 1.0901 1.1018 1.0874 1.0955 1.0926
irintensity: 1.0594 2.1869 0.2245 0.1968 1.8236 0.4377 3.1197 0.2275 0.3932 1.7442 0.5904 1.1878 1.1196 0.9968 0.8866 7.8699 2.9780 4.0629 0.6444 0.7784 3.4552 0.9420 5.9784 0.7109 1.5957 1.0293 7.4875 17.3702 28.7238 0.9015 3.4974 2.8794 1.7079 4.1736 2.9749 4.2932 12.4780 16.5213 25.5711 0.2440 25.8866 10.7309 12.0250 1.2704 168.0626 19.9905 35.9509 6.0621 9.2697 3.1461 0.9933 2.8691 11.1116 24.0091 9.1460 134.0584 33.3651 1.5847 18.0873 11.5051 41.5463 275.2595 7.0682 2.0055 1.8921 55.3373 33.0609 1.5939 4.7445 0.4456 1.9094 5.8631 9.4739 4.2417 3.3476 3.1112 25.2832 13.6597 7.0281 2.4539 2.4488 17.7855 16.2802 2.7178 41.4176 2.4178 4.4352 1.3209 13.7142 19.1144 140.1216 102.1568 127.2561 79.8669 93.6028 67.7153 63.2734 26.1104 21.8999 23.4837 31.2481 51.5772 21.8843 40.5165 15.7174 23.3405 21.7035 44.3690 15.4956 5.2075 5.6096 1.8872 12.2204 10.9549
temp: 298.150 k
press: 1.00000 atm
elementType: 16 8 8 7 6 6 6 6 6 6 6 6 6 6 6 6 6 6 6 1 1 1 1 1 1 1 1 1 1 1 1 1 1 1 1 1 1 1 1 1
symmnumber: 1
zpe: 868239.1 jmol-1
zpe.correction: 0.330695 hartree
zpe.thermalcorrener: 0.350449 hartree
zpe.thermalcorrenthalpy: 0.351393 hartree
zpe.thermalcorrgfe: 0.281468 hartree
zpe.sumelectzpe: -1185.958042 hartree
zpe.sumelectthermal: -1185.938288 hartree
zpe.sumelectthermalent: -1185.937344 hartree
zpe.sumelectthermalfe: -1186.007269 hartree
dipole: -4.2789 1.5972 0.4634
dipole: 4.5907
quadrupole: -123.7272 -114.0825 -125.0072
quadrupole: 18.9110 -1.2613 -2.4713
quadrupole: -2.7883 6.8565 -4.0682 18.9110 -1.2613 -2.4713
hfenergy: -1186.2887365 hartree
pointgroup: C01 [X(C15H21N1O2S1)]
dipole: 1.6300811 0.0518862 -0.7760599 debye
polarizability: 323.7200248|0.3913668|121.458542|-7.6871775|-8.4454687|177.4569171 unknown
InChI: InChI=1S/C15H21NO2S/c1-15(2,16-8-10-18-11-9-16)14(17)12-4-6-13(19-3)7-5-12/h4-7H,8-11H2,1-3H3
charge 0 multiplicity 1
40 atoms
S  5.850907 0.388811 -1.131816
O  -5.281433 -0.56196 0.905195
O  -0.475191 0.592236 1.434407
N  -2.670147 0.236542 -0.110603
C  -1.369569 0.352009 -0.850381
C  -2.842809 -0.996387 0.705547
C  -3.90622 0.477312 -0.895771
C  -1.159732 -0.877245 -1.797622
C  -1.370473 1.689559 -1.652197
C  -4.037295 -0.816514 1.655215
C  -5.101505 0.630204 0.064845
C  -0.206038 0.467397 0.203618
C  1.252336 0.436377 -0.204207
C  2.19463 0.343101 0.85987
C  1.774547 0.51611 -1.528599
C  3.581001 0.321251 0.630159
C  3.159512 0.503916 -1.770372
C  4.079726 0.402546 -0.694113
C  6.69102 0.292464 0.544011
H  -1.938223 -1.170291 1.308829
H  -3.031157 -1.894164 0.066603
H  -4.129995 -0.356362 -1.60956
H  -3.818641 1.410457 -1.476784
H  -0.314273 -0.756134 -2.491882
H  -0.986471 -1.802868 -1.221221
H  -2.073572 -1.018856 -2.404089
H  -1.78211 2.493783 -1.018142
H  -0.354739 1.987406 -1.952602
H  -1.978257 1.605031 -2.570497
H  -4.22871 -1.735445 2.234352
H  -3.832004 0.030404 2.342799
H  -4.936516 1.52161 0.708126
H  -6.04551 0.741865 -0.495472
H  1.802452 0.292809 1.880817
H  1.115244 0.60717 -2.394147
H  4.260232 0.242462 1.484427
H  3.528987 0.577297 -2.799278
H  6.422735 -0.641462 1.061335
H  6.435957 1.170376 1.157287
H  7.770004 0.295883 0.326614
