program: Gaussian 09
title: 000092327
version: EM64L-G09RevD.01
frameworkgroup: C1[X(C9H18N2O)]
method: RPBEPBE
basis: SDD
operation: Freq
keyword: #p
keyword: freq=noraman
keyword: PBEPBE/SDD
title: #p freq=noraman PBEPBE/SDD
converged: YES YES NO NO
title: Mulliken charges:
elementType: O N N C C C C C C C C C H H H H H H H H H H H H H H H H H H
charge: -0.291117 -0.033946 0.044835 0.010525 0.327165 -0.457088 -0.452720 -0.415051 -0.447509 -0.743148 -0.750048 -0.742613 0.184421 0.219905 0.219161 0.220333 0.222195 0.246469 0.213863 0.226255 0.266991 0.216002 0.213601 0.210357 0.219500 0.218276 0.213091 0.210250 0.213219 0.216825
chargesum: 0.00000
title: Mulliken charges with hydrogens summed into heavy atoms:
elementType: O N N C C C C C C C C C
charge: -0.291117 -0.033946 0.044835 0.194945 0.327165 -0.018022 -0.010191 0.045280 0.045737 -0.103188 -0.099180 -0.102319
polarizability: 1.43436745e+02 4.96143576e+00 1.06937161e+02 -8.46472965e+00 -7.67138116e-01 9.42826835e+01
1716.lowfreq: -10.1417 -0.0007 -0.0003 0.0004 13.3865 21.5042 40.0662 45.0251 129.8288
frequency: 39.8939 44.7908 129.8005 153.1112 179.7965 232.0158 238.8024 258.2138 260.4477 294.5557 302.5574 329.0637 341.8171 354.4105 382.3292 436.1129 442.9008 469.5277 500.7451 550.1291 653.3389 752.5210 774.4804 803.8416 829.3345 917.3319 925.4758 927.4724 941.6680 944.7243 958.3566 970.8028 1012.1199 1023.3988 1038.6011 1058.4129 1105.8738 1116.0597 1157.0415 1177.9465 1199.6265 1228.1788 1240.1051 1259.7176 1268.7401 1298.5473 1300.4320 1322.3897 1331.6187 1335.0314 1338.3841 1348.7644 1371.2701 1376.5843 1382.8897 1406.2900 1454.2622 1461.4595 1462.2926 1464.5715 1467.7807 1468.7926 1473.4479 1488.6974 1491.0097 1500.4897 2915.3167 2964.1345 2968.2924 2971.2053 2973.6721 2977.0557 2997.1529 3001.8471 3058.8892 3060.5882 3061.7196 3064.5432 3067.6809 3069.8708 3071.7792 3074.8400 3076.4248 3078.4054
redmass: 3.4388 3.5400 3.4473 3.0730 1.4400 1.2743 1.5962 1.1647 2.5794 3.1994 2.2796 2.3493 2.1804 3.6014 2.0893 2.7050 2.7792 3.1103 2.2502 3.0354 3.7601 2.7825 4.2931 1.5410 2.3261 2.0737 1.6920 1.8950 1.2473 1.7198 2.0878 1.9325 1.5594 1.4573 2.0218 2.2451 2.7177 1.9124 1.1864 2.1009 2.2020 2.8818 2.3977 1.4561 2.1434 1.5606 1.4319 1.5860 1.7430 1.5834 1.4920 1.4191 1.8021 1.2010 1.1954 1.2069 1.0827 1.0755 1.0612 1.0781 1.0492 1.0927 1.0497 1.0603 1.0498 1.0572 1.0821 1.0673 1.0359 1.0358 1.0654 1.0366 1.0601 1.0600 1.0995 1.0976 1.0995 1.0974 1.0986 1.0986 1.1004 1.0973 1.0981 1.0975
irintensity: 1.8795 2.2487 0.3522 2.5501 0.8017 0.1337 0.0339 0.1053 0.7002 1.5255 1.4156 0.6088 2.4849 0.8337 0.0680 0.4425 1.3635 0.2903 0.0213 3.4377 1.3765 2.5336 10.8806 0.0038 1.6288 3.3271 4.5383 23.3666 1.9712 9.8698 107.3027 26.9307 4.7839 3.0997 15.0926 37.7948 0.5147 15.3464 0.9864 3.3214 0.3991 11.2354 42.0181 1.1078 70.2091 1.6648 30.2023 59.4414 23.9953 12.7344 4.9112 9.4201 24.1558 24.1005 25.9593 14.3943 6.9690 7.5436 1.6856 18.9427 0.4293 6.4416 0.1352 6.9143 11.2644 28.7264 28.1233 33.8013 29.9571 39.1972 37.0625 10.7913 19.8057 28.6197 1.4011 21.0068 3.8825 20.2898 88.6965 37.5771 13.9069 24.0989 78.4527 49.8154
temp: 298.150 k
press: 1.00000 atm
elementType: 8 7 7 6 6 6 6 6 6 6 6 6 1 1 1 1 1 1 1 1 1 1 1 1 1 1 1 1 1 1
symmnumber: 1
zpe: 689196.2 jmol-1
zpe.correction: 0.262501 hartree
zpe.thermalcorrener: 0.275627 hartree
zpe.thermalcorrenthalpy: 0.276571 hartree
zpe.thermalcorrgfe: 0.223450 hartree
zpe.sumelectzpe: -537.445043 hartree
zpe.sumelectthermal: -537.431917 hartree
zpe.sumelectthermalent: -537.430973 hartree
zpe.sumelectthermalfe: -537.484093 hartree
dipole: 5.1147 0.7291 -1.6952
dipole: 5.4374
quadrupole: -98.5227 -72.7648 -73.9576
quadrupole: -2.5940 5.7430 0.3297
quadrupole: -16.7743 8.9835 7.7908 -2.5940 5.7430 0.3297
hfenergy: -537.7075437 hartree
pointgroup: C01 [X(C9H18N2O1)]
dipole: 2.0104332 -0.3072854 0.6633407 debye
polarizability: 143.3492925|-5.3821593|107.0634271|8.3368141|-1.0364204|94.2438705 unknown
InChI: InChI=1S/C9H18N2O/c1-9(2,3)8-4-6-11(10-12)7-5-8/h8H,4-7H2,1-3H3
charge 0 multiplicity 1
30 atoms
O  -3.913932 0.78722 -0.554342
N  -2.058268 -0.208269 0.253315
N  -3.285598 -0.325181 -0.37465
C  0.8549 -0.053039 0.374801
C  2.351222 0.069756 -0.108073
C  0.123817 -1.320133 -0.153224
C  -0.019613 1.192338 0.053475
C  -1.294256 -1.448592 0.450336
C  -1.439491 1.070347 0.655257
C  3.150111 -1.184011 0.349244
C  2.462636 0.199964 -1.651605
C  3.010163 1.31547 0.550606
H  0.903148 -0.141807 1.485978
H  0.686405 -2.235817 0.103623
H  0.042429 -1.275913 -1.25633
H  -0.108742 1.318368 -1.042451
H  0.440758 2.11204 0.456609
H  -1.870362 -2.263903 -0.019342
H  -1.215112 -1.657945 1.537522
H  -1.389528 1.10927 1.762612
H  -2.111545 1.875222 0.309264
H  2.825741 -2.099899 -0.17641
H  4.226803 -1.048096 0.136079
H  3.04017 -1.354418 1.437761
H  1.940856 1.098803 -2.027711
H  2.044803 -0.681935 -2.170774
H  3.525061 0.284913 -1.94769
H  2.891706 1.295254 1.65124
H  4.093387 1.336347 0.32859
H  2.580033 2.261947 0.176794
