program: Gaussian 09
title: 000092378
version: EM64L-G09RevD.01
frameworkgroup: C1[X(C16H26N2O4)]
method: RPBEPBE
basis: SDD
operation: Freq
keyword: #p
keyword: freq=noraman
keyword: PBEPBE/SDD
title: #p freq=noraman PBEPBE/SDD
converged: YES YES NO NO
title: Mulliken charges:
elementType: O O O O N N C C C C C C C C C C C C C C C C H H H H H H H H H H H H H H H H H H H H H H H H H H
charge: -0.298904 -0.297658 -0.217094 -0.250140 -0.236665 -0.207650 0.269845 -0.486119 -0.422438 0.096359 -0.396525 -0.023574 0.026582 0.209759 -0.417821 0.000270 -0.359304 -0.373973 -0.361153 -0.719533 -0.746402 -0.715304 0.202886 0.245896 0.229577 0.246485 0.226608 0.249325 0.267602 0.197083 0.241866 0.257422 0.248152 0.216617 0.230713 0.248049 0.218616 0.201791 0.191551 0.226070 0.227105 0.230279 0.222932 0.233255 0.218977 0.208548 0.220986 0.219050
chargesum: 0.00000
title: Mulliken charges with hydrogens summed into heavy atoms:
elementType: O O O O N N C C C C C C C C C C C C C C C C
charge: -0.298904 -0.297658 -0.217094 -0.250140 -0.236665 -0.207650 0.269845 -0.037336 0.053623 0.096359 0.079409 0.244028 0.223664 0.209759 0.081466 0.248422 0.088027 0.019369 0.105512 -0.036079 -0.071238 -0.066719
polarizability: 2.12089727e+02 -8.94600558e+00 1.85064297e+02 6.24813160e-01 -5.10130731e+00 1.76272898e+02
1716.lowfreq: -7.9164 -0.0003 0.0003 0.0005 2.3234 6.8509 18.9315 28.7904 33.1147
frequency: 16.5150 28.6816 33.0942 46.4816 55.6556 65.9812 77.4933 84.3715 90.1485 97.7437 115.6325 130.7872 150.2546 162.8099 175.1204 189.3064 207.2366 215.5137 223.5947 245.2783 266.7835 276.5752 287.3421 290.9706 306.4332 321.2446 330.5162 355.1668 392.5337 409.9368 416.5540 441.4390 485.4338 537.8924 589.4142 605.3190 646.8934 657.6730 693.0572 711.0338 722.0655 749.9084 766.6621 785.4750 797.6340 806.7776 815.8651 840.5111 865.9775 880.8078 896.2757 905.7461 926.0119 939.5589 960.5995 972.1105 984.9341 1012.4638 1025.9537 1026.5392 1034.6684 1055.7563 1066.4071 1070.6490 1085.0448 1099.6457 1101.4254 1108.5720 1116.9717 1124.4837 1133.8031 1150.9407 1159.3599 1167.7849 1171.2953 1197.2182 1228.4269 1233.4126 1236.5291 1262.9726 1277.4873 1281.0439 1295.7635 1302.5171 1319.7944 1331.4037 1336.9225 1344.1499 1351.6876 1354.3471 1372.6708 1380.9561 1389.4535 1395.5382 1396.9182 1397.7430 1401.4405 1427.2084 1446.5729 1451.5473 1459.6777 1468.5940 1472.8904 1475.3245 1479.5701 1481.5357 1482.2401 1484.0715 1485.9984 1494.3706 1636.6797 1691.1178 2955.0002 2959.9835 2969.8056 2977.5373 2985.0304 2985.2853 2996.9730 2999.6626 3011.3432 3025.1119 3031.7320 3055.1094 3065.2464 3066.6693 3069.3979 3074.1246 3077.3346 3081.0601 3082.2070 3085.8060 3086.3639 3087.2383 3104.7450 3113.1956 3174.4811 3187.4983
redmass: 5.1426 3.6940 4.2895 3.3517 3.6035 3.2054 4.8530 3.2054 2.6082 3.4133 2.8812 2.7282 5.6170 3.0752 2.2540 1.2283 1.8025 2.2965 2.7703 2.1677 1.6645 3.7082 2.8232 4.4474 4.9816 3.3221 2.6975 2.8968 2.5950 2.2128 2.1005 3.7927 2.7046 4.2738 6.0952 7.1550 4.7384 3.0273 5.1721 8.1649 4.7807 6.5284 1.3509 1.8730 2.9740 2.1172 2.5942 1.7706 1.9531 1.9403 2.0566 1.9284 1.9864 1.7971 1.2768 1.9919 2.3499 1.5469 1.3601 1.6565 1.8451 2.3582 2.2579 2.8415 2.8433 1.5612 1.4648 1.4147 1.4697 1.3218 2.1056 2.4758 2.1199 2.2909 2.4658 2.8348 1.4134 1.5092 1.5223 1.2431 1.6695 1.2037 1.5043 1.5111 1.4683 1.4844 1.8655 1.4021 1.5173 1.4255 1.8532 3.0823 1.2509 1.2073 1.6805 1.2701 1.8609 1.1305 1.1098 1.0841 1.0787 1.0759 1.0645 1.0445 1.0539 1.0468 1.1902 1.1912 1.0600 1.0467 10.9839 10.6649 1.0760 1.0653 1.0611 1.0371 1.0370 1.0367 1.0606 1.0597 1.1007 1.0591 1.0996 1.1012 1.0905 1.0630 1.0990 1.0531 1.0997 1.0983 1.1007 1.0978 1.0992 1.0997 1.0963 1.0921 1.1182 1.1197
irintensity: 1.6591 0.0871 0.4040 1.4787 2.2195 1.5567 1.0556 4.2574 0.4806 0.9057 0.7832 2.0422 10.2698 0.6950 2.4473 1.3116 0.9596 0.4222 3.8899 1.7599 2.3106 5.8766 0.9957 4.4240 12.7898 3.6675 0.9041 1.4639 11.6733 12.6759 2.6382 1.9466 0.8460 18.0475 21.4052 16.7993 5.2112 8.1180 3.5719 16.6678 7.5231 24.5252 8.3917 26.3651 25.0263 4.0681 20.4964 2.2565 8.3401 5.8933 5.1900 10.8350 6.8189 20.3002 5.9814 25.9109 0.1958 5.1862 6.4965 6.5586 6.2105 3.9321 37.4057 0.6043 1.4753 3.9753 2.3876 6.4063 8.2942 34.5334 3.7848 2.9966 4.4069 10.5086 16.6056 8.6548 4.5212 3.0913 2.6070 0.2274 37.9078 8.7151 9.9098 16.3809 4.9232 0.5993 26.8225 12.6747 69.1844 9.1492 50.4013 200.9360 2.2836 16.5250 11.5875 11.5456 24.5689 30.6058 42.6637 9.0964 6.0948 13.3436 6.0611 13.5922 10.3567 11.8060 5.1061 8.4849 20.6897 9.3484 422.4160 134.6757 10.2906 27.2521 43.7610 31.4758 21.2087 18.4090 18.1448 24.5799 19.7197 12.3083 22.0757 0.9662 8.4060 27.5960 47.5308 14.7302 43.0150 41.8544 35.4097 38.8493 35.9929 1.3016 12.6696 7.8012 24.3697 18.4724
temp: 298.150 k
press: 1.00000 atm
elementType: 8 8 8 8 7 7 6 6 6 6 6 6 6 6 6 6 6 6 6 6 6 6 1 1 1 1 1 1 1 1 1 1 1 1 1 1 1 1 1 1 1 1 1 1 1 1 1 1
symmnumber: 1
zpe: 1056280.7 jmol-1
zpe.correction: 0.402316 hartree
zpe.thermalcorrener: 0.426881 hartree
zpe.thermalcorrenthalpy: 0.427826 hartree
zpe.thermalcorrgfe: 0.346141 hartree
zpe.sumelectzpe: -1033.914894 hartree
zpe.sumelectthermal: -1033.890329 hartree
zpe.sumelectthermalent: -1033.889385 hartree
zpe.sumelectthermalfe: -1033.971070 hartree
dipole: -5.0901 1.6231 0.4314
dipole: 5.3600
quadrupole: -140.4636 -130.2084 -142.3826
quadrupole: 4.1134 10.3291 -1.8519
quadrupole: -2.7788 7.4765 -4.6977 4.1134 10.3291 -1.8519
hfenergy: -1034.3172103 hartree
pointgroup: C01 [X(C16H26N2O4)]
dipole: 2.0133404 0.5941299 -0.201023 debye
polarizability: 212.3957014|8.4947882|185.2443957|0.2649358|4.6356874|175.7868244 unknown
InChI: InChI=1S/C16H26N2O4/c1-4-11(3)6-16(5-2)14(19)17(7-12-9-21-12)15(20)18(16)8-13-10-22-13/h11-13H,4-10H2,1-3H3
charge 0 multiplicity 1
48 atoms
O  2.05204 3.400397 -0.807697
O  -5.229874 -0.65439 0.640515
O  -1.438193 -1.562207 -1.458091
O  -0.757517 1.008659 2.427841
N  0.56577 0.685415 0.477084
N  -1.432824 -0.368202 0.587796
C  0.456922 -0.049926 -0.815917
C  1.630858 -1.045322 -1.063971
C  1.70169 1.504582 0.908777
C  -0.898449 -0.775964 -0.638859
C  0.343379 0.917953 -2.040908
C  1.57334 2.981761 0.568116
C  2.127078 -1.920997 0.119009
C  -0.544553 0.514793 1.288956
C  -2.732076 -0.793616 1.125581
C  -3.882744 0.015124 0.537376
C  2.793469 3.83777 0.434544
C  3.457734 -2.609013 -0.305532
C  -4.576654 -0.43647 -0.709595
C  -0.867191 1.871367 -2.01314
C  1.076235 -2.958553 0.582294
C  4.181306 -3.366389 0.829008
H  2.485432 -0.453539 -1.452507
H  1.306043 -1.704677 -1.893382
H  2.627251 1.105685 0.456741
H  1.782131 1.410883 2.009554
H  0.295628 0.281937 -2.945052
H  1.277778 1.507333 -2.091772
H  0.629986 3.457264 0.865056
H  2.357097 -1.258238 0.981026
H  -2.880917 -1.861973 0.889332
H  -2.696781 -0.664289 2.221269
H  -3.895694 1.08215 0.797269
H  3.785926 3.383962 0.556631
H  2.729282 4.908607 0.659598
H  -4.220436 -1.346471 -1.206018
H  -5.079226 0.30301 -1.344487
H  3.24916 -3.306407 -1.143247
H  4.142683 -1.83513 -0.710285
H  -0.86696 2.501991 -1.106253
H  -0.829407 2.550018 -2.883202
H  -1.824694 1.320583 -2.057626
H  1.481438 -3.601521 1.383193
H  0.168214 -2.478469 0.985582
H  0.768494 -3.608229 -0.258651
H  4.368689 -2.701888 1.694127
H  3.594385 -4.230062 1.188723
H  5.157751 -3.752301 0.483294
