program: Gaussian 09
title: 000092340
version: EM64L-G09RevD.01
frameworkgroup: C1[X(C9H17NO2S)]
method: RPBEPBE
basis: SDD
operation: Freq
keyword: #p
keyword: freq=noraman
keyword: PBEPBE/SDD
title: #p freq=noraman PBEPBE/SDD
converged: YES YES NO NO
title: Mulliken charges:
elementType: S O O N C C C C C C C C C H H H H H H H H H H H H H H H H H
charge: 0.542621 -0.172993 -0.597968 -0.037768 -0.358280 -0.393462 -0.407495 -0.378007 -0.396135 -0.391339 -0.055850 -0.546867 -0.656629 0.209488 0.200381 0.189301 0.214289 0.204595 0.224351 0.242001 0.206794 0.237367 0.227875 0.208961 0.251115 0.231749 0.286674 0.275494 0.216750 0.222988
chargesum: 0.00000
title: Mulliken charges with hydrogens summed into heavy atoms:
elementType: S O O N C C C C C C C C C
charge: 0.542621 -0.172993 -0.597968 -0.037768 0.051588 0.010128 0.021452 0.070787 0.069108 0.068737 -0.055850 -0.028444 0.058603
polarizability: 1.74954159e+02 -3.38543571e+00 1.20795219e+02 6.06139343e+00 4.56510074e+00 1.13342889e+02
1716.lowfreq: -14.2312 -5.5728 -3.9871 -0.0006 0.0006 0.0020 19.7054 36.0726 54.9197
frequency: 18.3350 36.0659 54.7247 56.2557 116.3714 121.5595 166.9151 181.7880 207.4408 213.2489 242.7193 273.9262 296.9898 304.5439 345.8983 375.3908 403.9116 407.3407 482.5129 487.5843 519.7763 585.1353 632.2679 743.7238 780.5645 791.8650 809.9935 824.2428 866.0529 873.3273 889.1002 966.4219 974.7592 984.6795 1001.0548 1022.5343 1059.0127 1063.8624 1094.1736 1120.5588 1136.9474 1168.6921 1189.3805 1229.2787 1236.3475 1239.6018 1246.9105 1265.1282 1287.8454 1334.7306 1336.1646 1341.5087 1351.1636 1357.7177 1364.8914 1378.8544 1390.9143 1423.0288 1457.2900 1460.3943 1463.7393 1466.5559 1469.9870 1476.6542 1483.1418 1485.5154 1690.2852 2963.3404 2964.9226 2979.3128 2979.4293 2986.0363 2986.8435 3009.2547 3024.8912 3026.5896 3033.5970 3038.1347 3051.1438 3062.3644 3075.2743 3078.3358 3081.8571 3120.9871
redmass: 4.4662 3.8503 4.3039 2.1144 3.6686 5.4476 3.7285 2.7350 4.1718 1.9270 1.6200 4.2023 1.9324 3.4370 2.6372 3.7711 5.9701 2.7993 3.2020 1.9937 3.3803 8.0279 3.0341 2.6593 1.2973 2.3093 1.5001 6.3541 2.5052 1.9623 1.7852 2.1547 1.4281 1.9238 1.8097 1.2776 2.8080 2.1104 1.9491 2.0943 1.6469 3.1344 1.1532 1.2971 1.3196 1.3432 1.4103 1.3432 1.2051 1.3034 1.4845 1.3874 1.4118 1.3771 1.3598 1.6798 1.1893 1.1064 1.0882 1.0829 1.0379 1.0814 1.0900 1.0772 1.0862 1.0503 10.8059 1.0627 1.0653 1.0619 1.0353 1.0635 1.0625 1.0630 1.0965 1.0571 1.0988 1.1006 1.0996 1.0969 1.0984 1.1043 1.1010 1.1091
irintensity: 2.2799 0.7420 1.6410 1.5031 2.3640 0.7276 0.0882 0.9600 1.1788 7.6887 0.1507 8.5780 1.4251 0.6847 2.4237 0.9936 5.4369 2.4820 6.3237 0.9421 7.0486 10.5815 22.3601 13.0866 10.4460 13.0315 9.2241 53.8097 5.4224 5.7146 8.8019 7.5650 27.0171 6.1402 10.8347 2.2750 3.6860 7.6673 16.8312 48.6313 62.8171 68.0288 9.4842 15.8834 9.7767 34.8846 31.0205 1.9902 16.0254 0.5414 17.6268 0.2801 0.6233 3.9299 0.1008 46.1970 28.6730 2.1613 30.4050 3.5474 14.7983 1.6501 15.7172 17.5911 11.1746 14.0991 230.5511 37.3340 19.1875 23.3295 32.3080 42.2711 27.1926 30.9578 46.1104 13.4845 16.8321 51.2265 60.5208 32.7836 9.6292 14.0893 12.5160 17.5692
temp: 298.150 k
press: 1.00000 atm
elementType: 16 8 8 7 6 6 6 6 6 6 6 6 6 1 1 1 1 1 1 1 1 1 1 1 1 1 1 1 1 1
symmnumber: 1
zpe: 661484.7 jmol-1
zpe.correction: 0.251946 hartree
zpe.thermalcorrener: 0.267123 hartree
zpe.thermalcorrenthalpy: 0.268067 hartree
zpe.thermalcorrgfe: 0.207976 hartree
zpe.sumelectzpe: -955.288770 hartree
zpe.sumelectthermal: -955.273593 hartree
zpe.sumelectthermalent: -955.272649 hartree
zpe.sumelectthermalfe: -955.332740 hartree
dipole: -4.7802 -4.6417 -4.3077
dipole: 7.9342
quadrupole: -83.6716 -90.7893 -89.8643
quadrupole: -7.2589 -9.5182 -3.0294
quadrupole: 4.4368 -2.6809 -1.7559 -7.2589 -9.5182 -3.0294
hfenergy: -955.5407158 hartree
pointgroup: C01 [X(C9H17N1O2S1)]
dipole: 1.9614514 1.8117269 -1.6169546 debye
polarizability: 173.7119452|-6.8567803|122.1629455|-8.7343129|-3.2194753|113.2173773 unknown
InChI: InChI=1S/C9H17NO2S/c1-2-13(12)9(11)10-7-5-3-4-6-8-10/h2-8H2,1H3
charge 0 multiplicity 1
30 atoms
S  -1.964466 0.604652 0.875119
O  -0.815763 -1.803335 -0.174855
O  -2.823041 -0.512536 1.759647
N  0.555372 0.055528 -0.593891
C  2.894695 0.879921 1.026087
C  3.552524 -0.381925 0.408196
C  2.275524 1.83315 -0.029559
C  2.579447 -1.397695 -0.233062
C  0.812131 1.506762 -0.42401
C  1.593834 -0.790455 -1.258686
C  -0.551411 -0.587523 -0.110943
C  -3.041473 0.788027 -0.767666
C  -4.480653 1.070572 -0.343521
H  2.124852 0.584043 1.766912
H  3.672367 1.432704 1.587512
H  4.288625 -0.049348 -0.353548
H  4.133782 -0.905841 1.192247
H  2.921547 1.842258 -0.929317
H  2.271735 2.872817 0.35175
H  1.982316 -1.907125 0.54692
H  3.166017 -2.187125 -0.743881
H  0.138514 1.878718 0.367082
H  0.556783 2.04422 -1.360401
H  2.119724 -0.167363 -2.005441
H  1.065828 -1.599517 -1.792424
H  -2.563044 1.592044 -1.35291
H  -2.937814 -0.185481 -1.273359
H  -4.798836 0.311136 0.394454
H  -4.594308 2.070773 0.111175
H  -5.154911 1.006944 -1.217628
