program: Gaussian 09
title: 000092345
version: EM64L-G09RevD.01
frameworkgroup: C1[X(C10H12O3)]
method: RPBEPBE
basis: SDD
operation: Freq
keyword: #pfreq=noraman
keyword: PBEPBE/SDD
title: #p freq=noraman PBEPBE/SDD
converged: YES YES NO NO
title: Mulliken charges:
elementType: O O O C C C C C C C C C C H H H H H H H H H H H H
charge: -0.446998 -0.281113 -0.227608 -0.200668 0.431372 -0.434553 -0.355729 -0.679438 0.356088 -0.316691 -0.393025 0.258130 -0.749204 0.199478 0.235681 0.271102 0.231611 0.216474 0.236689 0.302612 0.254695 0.338997 0.252486 0.246894 0.252718
chargesum: 0.00000
title: Mulliken charges with hydrogens summed into heavy atoms:
elementType: O O O C C C C C C C C C C
charge: -0.108000 -0.281113 -0.227608 -0.001190 0.431372 -0.198871 -0.084627 0.005336 0.356088 -0.014079 -0.138330 0.258130 0.002894
polarizability: 1.78250130e+02 -1.09153389e-01 1.13117638e+02 2.24311709e-01 -3.01349483e+00 7.01057771e+01
1716.lowfreq: -20.4195 -7.8131 -0.0002 0.0000 0.0003 4.0739 25.9251 45.7751 50.7035
frequency: 25.1880 45.7513 50.5299 63.3166 118.9542 124.0829 190.0579 226.7976 237.9871 269.7293 335.2695 355.0153 372.2968 410.2400 422.0839 464.9432 539.9727 547.2929 556.6490 615.6226 651.3639 703.5716 736.5565 781.8907 843.8144 851.8559 875.5124 886.5816 967.0646 980.3390 986.2406 994.1491 1008.2991 1039.3848 1052.1958 1076.1250 1115.5330 1150.7859 1179.9772 1191.2207 1206.0391 1241.6052 1286.9015 1317.6095 1346.6411 1382.8579 1385.2213 1388.8606 1412.3561 1451.7196 1453.5224 1458.0846 1470.6794 1489.0703 1585.5475 1615.3958 1657.2956 2942.9830 2994.8078 3008.6604 3096.9475 3098.7795 3100.8007 3122.6997 3144.5250 3144.9693 3169.0132 3209.9794 3551.0240
redmass: 4.4356 2.5213 2.9844 1.4387 4.2265 4.6002 3.5890 1.3680 3.0296 3.7568 5.7634 1.6751 1.6879 3.2264 4.0567 3.6016 4.3422 2.6886 2.9498 6.1325 4.5691 5.1962 3.7092 4.4752 1.2877 1.5229 2.7144 7.0338 1.3435 1.3635 2.2150 1.9420 2.6862 1.6416 1.6627 1.8808 1.3204 2.3179 3.6208 1.3675 2.2886 1.2833 1.3798 1.4213 1.6173 1.2672 1.4952 2.6683 2.8245 1.0607 1.0470 1.0558 1.0738 2.3900 7.1460 6.4829 9.6313 1.0847 1.0349 1.0368 1.0973 1.1002 1.1008 1.0909 1.0889 1.1005 1.0965 1.0942 1.0659
irintensity: 4.1409 1.1079 0.9086 0.3133 1.3892 4.2300 1.4317 2.4928 1.0562 4.6365 6.8652 80.5979 109.4750 0.6881 5.8349 12.6945 0.8038 29.6300 3.4033 2.9205 16.6572 2.7792 1.4921 4.1175 4.9951 74.5007 25.0834 53.3080 1.1640 0.3665 33.9551 90.7264 37.0122 9.4196 40.7134 48.6518 13.4978 207.4633 383.3892 34.5668 60.6131 54.6110 9.4296 3.3319 35.1592 44.5155 32.6044 19.8512 10.3288 24.9392 18.8857 8.0198 9.4178 81.0716 6.5264 9.8268 196.2958 50.4785 18.2309 1.5447 6.8232 23.0789 34.9837 15.6049 6.7434 7.4423 4.6275 2.6687 6.8894
temp: 298.150 k
press: 1.00000 atm
elementType: 8 8 8 6 6 6 6 6 6 6 6 6 6 1 1 1 1 1 1 1 1 1 1 1 1
symmnumber: 1
zpe: 519052.7 jmol-1
zpe.correction: 0.197697 hartree
zpe.thermalcorrener: 0.211152 hartree
zpe.thermalcorrenthalpy: 0.212097 hartree
zpe.thermalcorrgfe: 0.155965 hartree
zpe.sumelectzpe: -612.963846 hartree
zpe.sumelectthermal: -612.950391 hartree
zpe.sumelectthermalent: -612.949446 hartree
zpe.sumelectthermalfe: -613.005578 hartree
dipole: -1.1339 -0.8752 -0.2097
dipole: 1.4476
quadrupole: -76.4933 -75.6663 -74.9471
quadrupole: 12.3431 -1.2915 -0.1434
quadrupole: -0.7911 0.0360 0.7551 12.3431 -1.2915 -0.1434
hfenergy: -613.1615431 hartree
pointgroup: C01 [X(C10H12O3)]
dipole: 0.4695114 0.2232449 0.2325472 debye
dipolederiv: -0.7575286 0.2363102 -0.1252657 0.3001026 -0.647152 -0.121173 -0.1441631 -0.1349533 -0.3526974 -2.2179663 0.1830081 0.2932821 0.2968983 -0.2513335 -0.1481286 0.5347313 -0.1504599 -0.5078488 -0.6754018 -0.0269226 -0.0941722 0.2216182 -0.3970855 -0.2267834 0.5035582 -0.2447914 -0.8497511 0.6358955 -0.115397 0.0456623 -0.2140767 0.635346 0.0548717 0.1201004 0.0527522 0.3520413 0.0338735 0.0762614 -0.0091667 0.0480724 -0.1530588 -0.001486 -0.0664134 -0.0210093 -0.1120322 -0.0645927 0.0014573 0.0293719 0.0418998 -0.1103789 0.1061324 0.0451558 0.0981601 0.0737213 -0.0269337 -0.0214856 -0.0221277 -0.0695203 -0.1236371 0.0660106 -0.0514981 0.0692839 0.02758 -0.1230827 -0.0747394 0.0382526 0.0508431 -0.0568686 0.0596287 0.0215248 0.0835218 0.0132249 1.3352293 -0.0639272 -0.0563719 0.0300634 0.0801537 0.0117912 0.1859499 -0.0030969 0.0983521 -0.2757993 0.0011411 -0.0176651 -0.0616053 -0.1236371 0.0153684 -0.1252922 0.0176771 -0.0975655 -0.2463551 0.0201754 0.0554017 0.0500626 -0.1296816 0.0697165 0.1011249 0.0707567 0.0025209 2.0706282 -0.0953496 -0.0952692 -0.4794195 0.3916539 0.4078458 -1.0092518 0.4308878 1.1743526 -0.3779048 -0.0502299 -0.1405634 -0.1073853 0.0010088 -0.0515491 -0.2419466 -0.0437797 -0.1010149 -0.0128793 0.0254459 0.0028815 -0.0137452 -0.0242723 -0.030398 -0.0594549 -0.0452863 -0.2098351 0.0266153 -0.026105 -0.087268 -0.0233498 0.1120427 -0.0675457 -0.0828 -0.0667764 -0.029725 0.048679 0.0337199 0.07592 0.0299176 0.1253866 -0.0522796 0.0756918 -0.0491727 0.0224329 0.095549 -0.0245109 -0.0726296 -0.008667 0.0840216 -0.0462387 -0.0366572 0.0125024 -0.1094308 0.0904976 0.0908988 0.0412337 0.0749229 -0.0845857 -0.0418895 0.0194359 -0.0813538 0.0610205 -0.2102779 -0.0347134 -0.0168764 -0.0416933 0.0955407 0.0116836 0.0005298 0.0210009 0.0935183 0.1336294 0.0218627 0.0471051 0.0186142 0.163627 -0.0425114 0.0377361 -0.0424 0.0825802 0.0595463 -0.026013 -0.0701757 -0.0208477 0.1382997 -0.0670532 -0.0783119 -0.0646496 0.0107142 0.3371166 -0.1562793 0.1216211 -0.1735451 0.1490976 0.0794294 0.1581129 0.081499 0.2079159 0.0779481 0.0156036 -0.0106404 -0.0224622 -0.0636893 -0.0324325 0.0022513 -0.0293278 0.129349 -0.0372683 0.0320703 0.0479562 0.0564009 0.1057005 -0.0439315 0.09234 -0.0486761 0.0372635 0.0807826 -0.022282 0.0195037 0.0169011 0.0835016 0.0909219 -0.0024541 0.0876914 -0.0166869 unknown
polarizability: 177.90851|-2.5036756|77.8598975|-3.995612|16.8844804|105.7051379 unknown
InChI: InChI=1S/C10H12O3/c1-7(11)9-3-5-10(6-4-9)13-8(2)12/h3-7,11H,1-2H3
charge 0 multiplicity 1
25 atoms
O  -3.958141 1.256244 0.265047
O  2.396568 0.147614 0.461459
O  3.27303 -0.720822 -1.548679
C  -3.334686 0.024449 -0.269673
C  -1.81537 0.058654 -0.125462
C  -0.975764 -0.405934 -1.164017
C  -1.217297 0.543193 1.067475
C  -3.98536 -1.125071 0.515991
C  0.998695 0.074078 0.162485
C  0.433045 -0.410441 -1.039548
C  0.182021 0.552356 1.213516
C  3.438054 -0.251742 -0.40445
C  4.762683 -0.010163 0.28512
H  -3.587802 -0.08383 -1.347548
H  -1.421978 -0.77411 -2.09648
H  -1.857549 0.919333 1.872455
H  -3.760827 -1.024646 1.59207
H  -3.603301 -2.100199 0.16689
H  -5.080511 -1.098647 0.382944
H  1.06852 -0.771373 -1.848129
H  0.659343 0.923719 2.125479
H  -3.533023 2.040551 -0.167694
H  4.889067 1.066382 0.494978
H  5.581788 -0.360499 -0.358891
H  4.791396 -0.538396 1.25336
