program: Gaussian 09
title: 000092321
version: EM64L-G09RevD.01
frameworkgroup: C1[X(C9H6N2O4)]
method: RPBEPBE
basis: SDD
operation: Freq
keyword: #pfreq=noraman
keyword: PBEPBE/SDD
title: #p freq=noraman PBEPBE/SDD
converged: NO YES NO NO
title: Mulliken charges:
elementType: O O O O N N C C C C C C C C C H H H H H H
charge: -0.188356 -0.190384 -0.193716 -0.187755 -0.213061 0.021699 0.233136 0.200726 0.107382 0.106492 -0.488751 -0.339484 0.420909 -0.364603 -0.597749 0.320172 0.281394 0.297907 0.260017 0.260111 0.253913
chargesum: 0.00000
title: Mulliken charges with hydrogens summed into heavy atoms:
elementType: O O O O N N C C C C C C C C C
charge: -0.188356 -0.190384 -0.193716 -0.187755 -0.213061 0.021699 0.233136 0.200726 0.107382 0.106492 -0.168579 -0.058090 0.420909 -0.066696 0.176291
polarizability: 1.91309706e+02 2.84315487e-01 1.45934278e+02 9.76489702e-01 -2.05437279e-01 5.13321304e+01
1716.lowfreq: -59.1634 -0.0011 -0.0007 -0.0005 2.8696 8.0416 10.2533 54.0429 72.4955
frequency: -59.1311 54.0326 72.4948 124.2530 146.8315 157.7257 205.4965 256.6848 265.8851 286.7078 291.0244 369.3190 420.0167 477.4486 495.2680 503.1998 582.8730 589.8896 636.4917 691.2956 695.5846 702.3435 740.1946 768.7753 788.7371 880.1130 881.9967 956.5750 962.4702 992.3939 1004.9210 1050.1098 1099.8919 1126.3407 1162.3760 1193.9040 1214.5523 1229.1112 1252.8731 1345.0175 1371.0542 1428.6264 1433.2304 1438.0107 1454.0321 1466.5808 1487.4149 1615.0305 1622.7363 1633.1911 1682.9868 3004.8343 3097.6190 3129.1594 3168.4661 3187.2292 3189.1152
redmass: 1.0177 14.7727 6.3005 4.8881 9.2796 7.1866 6.1325 3.6124 7.3207 11.4069 5.8692 8.9279 3.0900 6.8309 9.7660 5.8319 7.3280 9.6691 6.6588 8.0672 4.4104 6.8296 9.5492 8.8565 5.2308 1.5221 4.6556 1.4744 4.9284 2.9403 1.3726 2.1948 2.2667 1.3214 1.8823 5.2632 10.1033 2.3428 1.4212 6.5836 10.3475 1.4445 5.7108 2.9904 3.0688 1.1188 1.0498 9.0013 8.4397 11.5280 11.6544 1.0344 1.0998 1.1029 1.0908 1.0940 1.0959
irintensity: 0.0957 0.0074 0.4114 11.9967 2.2560 3.8624 0.9028 4.6024 0.3884 3.6399 0.1066 20.7140 1.5775 0.3729 3.1685 2.4566 6.4363 6.2355 0.1258 16.0906 48.4358 0.2866 5.5122 19.2326 0.1061 26.8387 1.9061 18.2754 19.2112 80.0739 0.5132 50.8768 17.5979 6.1756 4.4960 128.1759 155.2672 38.0858 1.2809 177.1351 90.3722 59.5593 20.1961 25.7029 5.9755 19.0612 12.6810 6.7966 65.9674 411.1418 44.4554 25.6890 12.9334 0.9910 1.6018 6.4589 3.7846
temp: 298.150 k
press: 1.00000 atm
elementType: 8 8 8 8 7 7 6 6 6 6 6 6 6 6 6 1 1 1 1 1 1
symmnumber: 1
zpe: 371348.0 jmol-1
zpe.correction: 0.141439 hartree
zpe.thermalcorrener: 0.153124 hartree
zpe.thermalcorrenthalpy: 0.154068 hartree
zpe.thermalcorrgfe: 0.102913 hartree
zpe.sumelectzpe: -755.848568 hartree
zpe.sumelectthermal: -755.836883 hartree
zpe.sumelectthermalent: -755.835939 hartree
zpe.sumelectthermalfe: -755.887094 hartree
dipole: 2.8954 1.7406 0.0253
dipole: 3.3784
quadrupole: -98.2191 -94.2995 -83.3729
quadrupole: -9.1472 0.0531 0.0021
quadrupole: -6.2553 -2.3357 8.5910 -9.1472 0.0531 0.0021
hfenergy: -755.9900074 hartree
pointgroup: C01 [X(C9H6N2O4)]
dipole: -1.1480595 0.669769 -0.0098584 debye
dipolederiv: -0.523836 -0.1340326 -0.0018761 -0.0526345 -1.0432309 0.0036527 0.0027947 0.0032342 -0.3212308 -0.7237388 0.3488915 0.0004441 0.2048187 -0.8962838 -0.0047285 0.0051968 -0.0020158 -0.3239082 -0.8374432 -0.1821797 -0.001791 -0.1244537 -0.5582755 -0.0013939 -0.0003581 0.0001355 -0.2165902 -0.6343787 0.1564994 -0.0004968 0.149675 -0.6940804 0.0006537 0.0000458 -0.0015259 -0.2137417 -0.9759034 0.0942985 -0.0156697 0.0738332 -1.2190713 -0.004031 0.0437318 0.0089123 -0.198581 1.7640698 -0.0807981 0.0029755 -0.1826805 1.0716372 0.0006001 0.0023199 0.0012601 0.185032 -0.3657772 -0.1044983 -0.0018668 -0.057136 -0.1950257 -0.002056 -0.0035719 0.0053523 -0.0001899 -0.3085449 0.0965819 -0.0014822 0.0705846 0.0580348 0.0017896 -0.0031464 -0.0064862 0.0125675 1.1626316 -0.1538698 0.0082416 -0.0512236 1.4312762 -0.0045329 0.0056026 -0.0065192 0.2371379 1.1459693 -0.0857876 0.0046139 -0.0865667 1.5243436 0.0084663 0.002728 0.009271 0.2376123 0.0877669 -0.0759151 0.0035582 0.0257275 -0.0141489 0.0011261 -0.0005464 -0.0003082 -0.0600418 -0.2733603 -0.1783461 0.0021566 -0.0368112 0.154037 0.0006087 -0.0015476 0.000031 -0.0867728 -0.4974036 0.0924634 -0.0021827 0.196101 -0.0043701 -0.0025127 0.0001628 0.0004084 0.0690155 0.1213223 0.1263981 -0.001094 -0.2012552 -0.052339 0.0016102 0.000134 0.0002042 -0.0981763 0.4416255 0.0936684 0.0383385 0.0883781 0.0862619 0.0093778 -0.0089171 -0.0004853 0.2002904 0.1482737 0.0084159 0.0001072 0.0049663 0.0996945 -0.0000591 -0.0013742 0.00009 0.1721404 0.0868144 0.0453902 0.0001438 0.014081 0.0128463 -0.0000616 -0.0004236 -0.0005478 0.1569978 0.0919439 -0.0577789 -0.0000598 -0.0243539 0.1083042 -0.0000648 0.0000986 -0.0001965 0.1720345 0.0418058 0.001566 0.0169047 0.1015699 0.0328536 -0.0839732 0.0372001 -0.0498558 0.0882971 0.0737833 0.02015 -0.0257201 -0.0744961 0.0006614 0.0898523 0.0138135 0.0675348 0.0749789 -0.0256204 -0.0311171 -0.0252449 -0.0381237 0.096875 -0.0143236 -0.0939433 -0.0284932 -0.0868714 unknown
polarizability: 191.3089071|0.3122944|145.9344205|1.0038459|0.2639472|51.3327866 unknown
InChI: InChI=1S/C9H6N2O4/c1-10-8(12)6-3-2-5(11(14)15)4-7(6)9(10)13/h2-4H,1H3
charge 0 multiplicity 1
21 atoms
O  -1.755219 -2.539983 0.008803
O  -2.904781 2.0289 0.009304
O  4.285961 0.668201 0.001778
O  3.681925 -1.532652 -0.001539
N  -2.669215 -0.341407 -0.004551
N  3.404449 -0.273474 0.00236
C  -0.34402 -0.485565 -0.002956
C  -0.690276 0.887895 -0.002427
C  -1.608004 -1.295537 -0.003657
C  -2.18803 0.999799 -0.003151
C  0.989787 -0.908043 -0.000212
C  0.287031 1.894294 0.000936
C  1.965335 0.11886 0.001103
C  1.644994 1.496627 0.001771
C  -4.090875 -0.70076 -0.004965
H  1.279146 -1.961767 0.00091
H  0.002984 2.950472 0.002828
H  2.459885 2.225187 0.003263
H  -4.660794 0.108316 0.478495
H  -4.221986 -1.645712 0.545534
H  -4.463696 -0.834453 -1.035526
