program: Gaussian 09
title: 000092409
version: EM64L-G09RevD.01
frameworkgroup: C1[X(C22H25NO2)]
method: RPBEPBE
basis: SDD
operation: Freq
keyword: #p
keyword: freq=noraman
keyword: PBEPBE/SDD
title: #p freq=noraman PBEPBE/SDD
converged: NO YES NO NO
title: Mulliken charges:
elementType: O O N C C C C C C C C C C C C C C C C C C C C C C H H H H H H H H H H H H H H H H H H H H H H H H H
charge: -0.420296 -0.228371 -0.071413 -0.119407 -0.431462 -0.447006 -0.410411 -0.351121 -0.348184 -0.464264 0.121554 -0.332454 0.242838 0.288320 0.258104 -0.394382 -0.389882 -0.415258 -0.400916 -0.227818 -0.231669 -0.233426 -0.246824 -0.249045 -0.246729 0.262818 0.229728 0.193966 0.247044 0.205051 0.201294 0.210755 0.174362 0.213994 0.191992 0.207037 0.213392 0.238205 0.222270 0.375480 0.253596 0.254580 0.242328 0.250623 0.225188 0.226957 0.224441 0.226939 0.228475 0.229010
chargesum: 0.00000
title: Mulliken charges with hydrogens summed into heavy atoms:
elementType: O O N C C C C C C C C C C C C C C C C C C C C C C
charge: -0.044816 -0.228371 -0.071413 0.143411 -0.007768 0.005089 0.001638 0.037235 0.050845 -0.012667 0.121554 -0.110184 0.242838 0.288320 0.258104 -0.140786 -0.135303 -0.172931 -0.150293 -0.002630 -0.004712 -0.008985 -0.019886 -0.020571 -0.017720
chargesum: -0.00001
polarizability: 3.12992047e+02 6.01973963e+00 2.83107195e+02 -1.83368227e+01 -1.31149555e+01 1.66379968e+02
1716.lowfreq: -7.4125 -0.6886 -0.1772 -0.0088 -0.0002 5.1683 11.1858 20.4338 24.5457
frequency: 10.1680 20.3974 24.4707 31.8143 43.0662 58.2150 62.7339 72.3811 90.8759 115.1056 120.5858 152.7119 184.8138 188.5983 219.0909 240.0425 254.1188 277.1472 299.2166 305.8415 328.0144 350.3142 387.0367 405.4459 407.9922 411.6489 450.4294 464.1990 480.5025 511.3723 535.2878 569.0409 589.1871 609.9712 613.2418 615.9382 630.9803 643.1310 689.0511 702.6221 707.6540 714.7909 760.8089 773.0246 778.9667 792.9314 826.9108 851.6725 855.9647 859.8274 864.8932 894.9820 905.4825 925.0249 929.8121 932.5774 953.7157 976.7249 980.5043 987.2790 988.1121 989.3921 994.3687 995.8053 1007.6690 1027.5930 1028.2784 1032.3478 1049.9642 1057.2274 1081.7704 1082.3888 1090.2359 1106.6957 1116.8300 1141.0328 1159.3381 1164.1571 1171.8367 1172.1207 1173.6170 1191.4357 1192.2243 1192.8460 1221.2390 1241.3721 1259.0105 1265.4927 1276.0655 1290.0855 1293.0993 1304.7544 1314.1466 1316.6824 1321.6615 1325.9095 1346.1506 1353.5214 1359.4755 1368.6159 1373.3460 1379.0407 1397.0883 1431.2946 1434.2574 1454.5873 1455.4913 1462.7446 1467.8339 1473.6139 1478.1073 1481.2812 1486.1146 1579.4828 1580.3372 1607.0123 1609.7164 1627.9846 1654.3259 2828.1413 2854.1630 2870.5066 2966.0679 2979.6661 2991.0885 3003.8124 3008.0662 3041.8509 3048.6503 3051.8707 3056.6094 3068.4612 3081.1307 3120.8669 3122.2621 3127.1471 3129.0636 3140.2058 3141.9684 3148.6808 3149.9334 3163.7713 3164.2939 3510.5759
redmass: 4.8821 5.7164 6.6110 4.8423 4.0187 4.2498 3.8975 4.2459 4.8900 3.6183 3.3204 2.6289 3.2320 3.7543 4.2489 3.7723 2.3925 3.1372 4.3319 4.0267 3.1843 3.4604 2.7522 2.8459 2.7431 2.8256 3.7808 3.2980 3.1247 3.4217 2.8327 2.7548 1.8360 5.3656 2.7007 5.8828 4.1192 4.3400 3.3562 1.7471 1.7370 4.3918 1.5596 2.3350 1.9799 1.5111 3.2462 1.2505 1.3424 1.2942 1.3726 3.7836 2.9142 1.4954 2.1114 1.6042 1.8124 1.4083 1.3770 2.5977 5.2132 5.3675 1.3278 1.3256 2.3504 2.2425 2.4056 2.6348 2.7232 1.8480 1.6911 1.6972 2.0799 2.2171 2.4835 1.4474 1.9868 2.4642 1.0552 1.0551 2.4803 1.1529 1.3017 1.1286 1.4153 1.3760 1.8900 1.2331 1.3893 1.3064 1.5138 1.3865 1.4726 1.4246 1.4039 1.3870 1.4422 1.5717 2.0251 1.3877 5.4983 4.1096 1.4752 2.2599 2.2843 1.0852 1.0884 1.0918 1.0818 1.0930 2.1912 1.1003 2.4179 5.8153 5.8583 6.0338 6.0627 8.0137 8.7132 1.0715 1.0698 1.0697 1.0649 1.0653 1.0606 1.0806 1.0881 1.0893 1.0904 1.1006 1.0909 1.1005 1.0890 1.0845 1.0844 1.0873 1.0875 1.0922 1.0923 1.0960 1.0964 1.1016 1.1015 1.0639
irintensity: 0.1551 0.4628 0.4457 0.1684 0.0812 0.0369 0.0658 0.3116 0.9413 0.5925 2.2163 0.4495 0.7046 2.4928 0.1724 0.6279 2.3773 0.7816 0.1826 2.9551 2.2630 1.0561 7.5987 0.1484 0.9888 2.0299 7.9210 10.3824 1.0795 8.4250 7.6233 20.4129 62.0066 8.9371 55.1208 2.8505 15.2528 3.7532 44.6273 53.0625 51.2281 0.5225 49.6402 7.7163 56.6895 0.5609 15.3925 0.5479 5.2740 4.1776 8.0854 4.9312 1.5016 2.1917 10.0577 7.5269 19.8066 0.6255 0.4744 15.4834 1.3043 0.5638 0.1953 0.2427 5.1617 20.7813 17.9106 163.7475 48.4684 100.3675 11.9570 12.0144 26.6458 31.5322 17.4869 2.7210 10.7851 8.6745 0.0377 0.0740 10.0972 0.0920 4.3754 0.1840 1.0742 3.8500 0.3120 4.0269 1.1722 21.3115 0.4399 24.0259 7.7322 5.1659 0.9212 11.6049 1.2705 60.7874 5.9236 4.6004 2.6546 8.1574 1.2740 8.3407 11.1772 2.2332 9.6714 6.5625 7.4762 5.1387 9.6455 10.3924 18.2716 2.2581 0.1284 9.1753 3.4421 1.6522 216.0900 64.2744 49.3165 113.8703 21.2207 22.7426 33.0850 12.2346 13.6056 30.7440 24.8785 42.9150 23.8554 39.3542 39.5297 3.9882 1.9245 0.5729 1.2550 19.6848 21.0417 39.6871 34.5322 30.7095 16.3753 20.8934
temp: 298.150 k
press: 1.00000 atm
elementType: 8 8 7 6 6 6 6 6 6 6 6 6 6 6 6 6 6 6 6 6 6 6 6 6 6 1 1 1 1 1 1 1 1 1 1 1 1 1 1 1 1 1 1 1 1 1 1 1 1 1
symmnumber: 1
zpe: 1092833.1 jmol-1
zpe.correction: 0.416238 hartree
zpe.thermalcorrener: 0.439346 hartree
zpe.thermalcorrenthalpy: 0.440290 hartree
zpe.thermalcorrgfe: 0.359414 hartree
zpe.sumelectzpe: -1056.703648 hartree
zpe.sumelectthermal: -1056.680541 hartree
zpe.sumelectthermalent: -1056.679596 hartree
zpe.sumelectthermalfe: -1056.760472 hartree
dipole: -0.0125 1.7373 0.0727
dipole: 1.7389
quadrupole: -137.5636 -141.7268 -149.8106
quadrupole: 5.7670 -4.6179 1.2831
quadrupole: 5.4700 1.3069 -6.7769 5.7670 -4.6179 1.2831
hfenergy: -1057.1198865 hartree
pointgroup: C01 [X(C22H25N1O2)]
dipole: -0.046328 -0.681173 -0.04329 debye
polarizability: 311.6981013|0.5982294|278.7783396|25.9432998|23.2390742|172.0027696 unknown
InChI: InChI=1S/C22H25NO2/c24-22(25)20-13-7-15-23(17-20)16-8-14-21(18-9-3-1-4-10-18)19-11-5-2-6-12-19/h1-6,9-12,14,20,24H,7-8,13,15-17H2
charge 0 multiplicity 1
50 atoms
O  -7.475981 1.348917 -0.856829
O  -6.221552 2.678045 0.570985
N  -2.751488 0.232283 -0.329717
C  -5.180478 0.696451 -0.505971
C  -3.826301 1.179836 0.053883
C  -5.515845 -0.72701 0.033892
C  -4.345242 -1.68389 -0.27935
C  -3.006734 -1.117204 0.235911
C  -1.404004 0.759298 0.004663
C  -0.268187 0.029954 -0.757621
C  -6.286033 1.681587 -0.18426
C  1.064977 0.709917 -0.534856
C  2.272098 0.133763 -0.223564
C  3.459425 1.00175 0.071415
C  2.469736 -1.351232 -0.170021
C  4.767131 0.605359 -0.326889
C  3.144393 -1.949914 0.930812
C  3.315606 2.247894 0.744879
C  2.007002 -2.198647 -1.214074
C  5.883589 1.434375 -0.085318
C  3.327146 -3.347682 0.997344
C  4.431006 3.077772 0.98674
C  2.196577 -3.597087 -1.153646
C  5.722103 2.6774 0.569774
C  2.852667 -4.179296 -0.044814
H  -5.101171 0.623797 -1.608833
H  -3.58547 2.176152 -0.358046
H  -3.91258 1.295659 1.164103
H  -6.456448 -1.088397 -0.417034
H  -5.670119 -0.670227 1.130688
H  -4.5304 -2.671531 0.184312
H  -4.271256 -1.834456 -1.373406
H  -3.027072 -1.080573 1.35808
H  -2.182862 -1.791036 -0.055831
H  -1.199055 0.71365 1.104967
H  -1.385702 1.829486 -0.280408
H  -0.541915 0.044879 -1.833358
H  -0.211519 -1.030167 -0.455738
H  1.040452 1.807599 -0.62015
H  -8.178486 2.013093 -0.618026
H  4.903214 -0.352872 -0.84022
H  3.519679 -1.311494 1.738545
H  2.326049 2.551547 1.105159
H  1.524361 -1.75202 -2.090553
H  6.879162 1.111939 -0.411029
H  3.840375 -3.788174 1.859673
H  4.29601 4.029614 1.513167
H  1.840077 -4.22948 -1.974686
H  6.589314 3.319229 0.761219
H  3.000154 -5.264055 0.003433
