program: Gaussian 09
title: 000092366
version: EM64L-G09RevD.01
frameworkgroup: C1[X(C19H19ClFNO3)]
method: RPBEPBE
basis: SDD
operation: Freq
keyword: #p
keyword: freq=noraman
keyword: PBEPBE/SDD
title: #p freq=noraman PBEPBE/SDD
converged: YES YES NO NO
title: Mulliken charges:
elementType: Cl F O O O N C C C C C C C C C C C C C C C C C C C H H H H H H H H H H H H H H H H H H H
charge: -0.002860 -0.176745 -0.278183 -0.229933 -0.263628 -0.277789 -0.160437 0.392787 -0.698656 0.242245 0.120269 0.042922 0.265376 -0.323365 -0.269726 -0.697160 -0.680709 -0.312211 -0.343508 -0.326186 -0.371112 0.406427 -0.235370 -0.226028 -0.228842 0.291282 0.234554 0.246441 0.224311 0.235777 0.287149 0.267907 0.215036 0.232172 0.224384 0.214064 0.252686 0.225287 0.265018 0.250471 0.267312 0.233082 0.232502 0.232984
chargesum: 0.00000
title: Mulliken charges with hydrogens summed into heavy atoms:
elementType: Cl F O O O N C C C C C C C C C C C C C C C C C C C
charge: -0.002860 -0.176745 -0.278183 -0.229933 -0.263628 -0.277789 0.130845 0.392787 0.006650 0.242245 0.120269 0.278699 0.265376 -0.036216 -0.001819 -0.025567 0.011328 -0.312211 -0.078491 -0.075715 -0.103799 0.406427 -0.002287 0.006475 0.004142
polarizability: 2.35267729e+02 -1.06303672e+01 2.52819170e+02 -1.32761414e+01 -2.32760169e+01 2.00128703e+02
1716.lowfreq: -7.9588 -1.9096 -0.0011 0.0005 0.0009 4.1009 6.7875 19.4551 28.8420
frequency: 6.1483 19.3268 28.8246 39.1668 42.5016 46.7221 68.8755 78.1408 98.3992 110.0898 122.3385 144.6362 167.8456 181.7682 193.1773 194.4073 204.2301 235.9994 237.3926 242.7095 262.2148 291.2143 309.2430 327.3362 354.6151 373.1882 387.7387 400.0383 406.0190 415.8799 441.9884 453.2506 464.4991 482.7434 522.8669 537.5445 578.6824 613.6978 616.0952 631.0124 670.6349 689.7673 699.5026 701.6307 709.7485 733.9990 773.7975 787.8620 807.4257 821.6352 827.5488 854.4161 874.7194 886.9711 911.4353 928.8693 934.5929 942.3889 946.9604 961.4547 982.2881 990.4975 1002.2341 1025.1853 1029.7976 1046.9272 1082.2708 1084.8019 1098.5228 1106.4031 1131.8158 1152.8328 1158.5127 1169.5123 1174.5532 1188.0687 1190.1250 1204.2055 1241.7214 1262.2934 1292.7615 1313.0795 1317.3764 1328.0061 1333.4232 1352.6021 1366.9925 1381.8351 1381.9374 1390.2255 1395.1819 1395.7888 1433.5105 1456.9188 1465.4505 1466.4168 1472.3829 1478.4140 1479.9803 1482.6096 1487.5036 1551.4239 1580.5339 1591.3571 1603.2200 1609.4420 1622.8031 2957.5583 2989.3526 2992.7642 3003.3115 3029.8834 3085.0361 3092.6400 3096.0624 3105.1831 3105.3213 3108.0165 3130.1757 3140.8814 3153.5771 3163.3206 3166.6153 3172.3920 3185.3044 3188.9334
redmass: 5.0089 3.5945 6.1304 5.3301 6.1469 5.6819 5.1618 6.4250 4.7025 4.1269 5.2605 5.2963 4.7113 3.8090 1.0506 5.7154 3.2864 2.2705 1.7457 1.8258 2.1153 4.5684 5.2845 4.1513 8.1649 5.8038 4.7513 4.8426 2.8672 3.2916 3.3501 3.9953 4.7813 4.1452 4.9640 4.9355 4.8986 6.4058 8.0069 4.8049 5.7922 6.4183 5.0606 2.1023 2.6154 4.1492 4.0592 2.3566 2.8091 2.0523 4.7352 1.2478 1.5972 2.5765 2.9542 1.2234 1.4611 1.3590 1.3466 2.4871 1.4179 5.7252 1.3335 2.4048 3.2387 2.0947 2.0517 1.8777 2.3160 2.0055 1.3861 3.0822 2.1963 2.7933 1.0543 2.0269 1.1150 2.0515 1.9018 2.1513 4.3321 1.3371 1.3252 1.5109 1.4069 2.5953 3.3911 1.3251 6.4719 1.3396 2.1471 1.4788 2.2402 1.0518 1.0691 1.0479 1.0496 2.1348 2.1976 1.2533 1.0487 9.6975 8.4405 6.5432 7.2453 6.0520 10.6861 1.0801 1.0355 1.0360 1.0354 1.0866 1.0994 1.0987 1.1004 1.0998 1.1000 1.1016 1.0851 1.0886 1.0929 1.0960 1.0894 1.1007 1.0932 1.0965
irintensity: 0.0110 0.3185 0.4798 0.0278 1.5567 0.5026 1.5854 1.9538 0.4556 1.3085 1.5489 3.8913 1.9605 1.0311 0.0426 0.8245 0.4665 0.6455 0.1677 1.3036 0.3812 4.3449 5.1492 1.9686 5.5974 0.1452 7.9330 0.8978 0.3774 4.9126 3.5836 6.7551 7.3831 9.2608 0.7372 2.9235 2.3649 1.4408 21.5494 35.0600 8.8585 21.7505 4.5196 42.7458 69.8144 23.3439 14.7038 33.8273 25.6559 13.6020 19.4531 1.6447 22.9166 2.3200 16.2717 2.5579 3.8798 0.2007 0.6056 28.6048 0.7692 1.4090 0.4919 14.2329 17.1553 43.8876 124.7227 173.8523 6.3117 6.1587 10.9332 55.5753 6.1489 127.8823 0.1595 6.8881 10.5451 66.4493 36.1269 4.7275 391.9848 15.1882 2.6837 5.9270 4.6823 4.5943 10.1271 30.5051 3.1941 17.8028 7.3145 31.3565 8.6778 8.5239 41.0037 4.2960 7.8948 167.1312 11.4592 49.7354 22.3486 194.5149 7.9836 16.8181 2.3773 4.7588 198.8045 71.2954 15.9338 17.9479 13.6827 4.3201 1.7645 54.3615 26.7454 20.1921 23.5124 16.9501 0.2167 6.3461 18.3023 21.6588 1.8645 12.2039 0.0262 1.2327
temp: 298.150 k
press: 1.00000 atm
elementType: 17 9 8 8 8 7 6 6 6 6 6 6 6 6 6 6 6 6 6 6 6 6 6 6 6 1 1 1 1 1 1 1 1 1 1 1 1 1 1 1 1 1 1 1
symmnumber: 1
zpe: 885344.3 jmol-1
zpe.correction: 0.337210 hartree
zpe.thermalcorrener: 0.361941 hartree
zpe.thermalcorrenthalpy: 0.362885 hartree
zpe.thermalcorrgfe: 0.278812 hartree
zpe.sumelectzpe: -1573.939940 hartree
zpe.sumelectthermal: -1573.915209 hartree
zpe.sumelectthermalent: -1573.914265 hartree
zpe.sumelectthermalfe: -1573.998337 hartree
dipole: -0.4024 -1.5796 2.5464
dipole: 3.0234
quadrupole: -144.0787 -169.3698 -144.9549
quadrupole: 5.6114 9.1604 -10.9974
quadrupole: 8.7224 -16.5687 7.8462 5.6114 9.1604 -10.9974
hfenergy: -1574.2771497 hartree
pointgroup: C01 [X(C19H19Cl1F1N1O3)]
dipole: -0.1424413 -0.2773149 1.1479292 debye
polarizability: 228.8989156|-14.9295144|240.2953732|-15.8662784|-31.0308559|219.0213124 unknown
InChI: InChI=1S/C19H19ClFNO3/c1-12(2)25-19(24)13(3)22(15-9-10-17(21)16(20)11-15)18(23)14-7-5-4-6-8-14/h4-13H,1-3H3
charge 0 multiplicity 1
44 atoms
Cl -1.396463 4.157109 -2.068025
F  -1.066168 4.412979 0.935942
O  2.830603 -0.494366 0.161989
O  3.672774 0.367453 -1.836752
O  0.319921 -3.029599 -0.695913
N  0.310483 -0.716556 -1.003353
C  1.532308 -0.868929 -1.849095
C  -0.05028 0.593253 -0.516593
C  1.365602 -0.398149 -3.306016
C  2.779973 -0.242648 -1.20346
C  -0.248004 -1.910271 -0.492331
C  4.077708 -0.040874 0.892703
C  -1.550731 -1.849938 0.25852
C  -0.495583 1.594889 -1.415671
C  0.053602 0.884689 0.867321
C  3.650733 0.153225 2.348674
C  5.168207 -1.102693 0.695755
C  -0.82565 2.873101 -0.929232
C  -0.299568 2.158342 1.353458
C  -2.633443 -1.016669 -0.124348
C  -1.722863 -2.765068 1.329515
C  -0.730266 3.144857 0.449398
C  -3.861423 -1.08596 0.568544
C  -2.943681 -2.818468 2.033432
C  -4.016708 -1.976627 1.656075
H  1.705049 -1.966972 -1.840797
H  1.329501 0.700683 -3.389228
H  2.231857 -0.735121 -3.899385
H  0.450242 -0.836935 -3.738989
H  4.388443 0.914659 0.43085
H  -0.613721 1.373486 -2.47845
H  0.413793 0.110071 1.548395
H  4.517191 0.481762 2.950466
H  2.862132 0.92094 2.429521
H  3.271694 -0.792823 2.774259
H  6.083369 -0.805174 1.23966
H  5.424057 -1.208686 -0.371676
H  4.833368 -2.080322 1.084924
H  -0.237781 2.403721 2.417554
H  -2.530181 -0.33269 -0.971866
H  -0.896467 -3.436366 1.584449
H  -4.695878 -0.44782 0.258194
H  -3.063068 -3.520474 2.865794
H  -4.968582 -2.022424 2.196784
