program: Gaussian 09
title: 000092319
version: EM64L-G09RevD.01
frameworkgroup: C1[X(C18H19N)]
method: RPBEPBE
basis: SDD
operation: Freq
keyword: #pfreq=noraman
keyword: PBEPBE/SDD
title: #p freq=noraman PBEPBE/SDD
converged: YES YES NO NO
title: Mulliken charges:
elementType: N C C C C C C C C C C C C C C C C C C H H H H H H H H H H H H H H H H H H H
charge: -0.023449 -0.376341 -0.571326 -0.335007 0.509455 -0.358874 -0.424125 -0.424427 0.343555 -0.693460 -0.394115 -0.394762 0.358880 -0.383667 -0.382496 -0.381436 -0.381980 0.392184 -0.261688 0.207403 0.207615 0.207843 0.207897 0.188532 0.188361 0.197145 0.197201 0.234982 0.235038 0.210172 0.217583 0.210137 0.235214 0.235694 0.245881 0.246191 0.255087 0.255104
chargesum: 0.00000
title: Mulliken charges with hydrogens summed into heavy atoms:
elementType: N C C C C C C C C C C C C C C C C C C
charge: -0.023449 0.038676 -0.155586 0.041886 0.509455 0.035472 -0.189143 -0.189389 0.343555 -0.055568 -0.158901 -0.159068 0.358880 -0.137787 -0.136305 -0.126349 -0.126876 0.392184 -0.261688
polarizability: 3.80446519e+02 -1.56642478e+01 1.64524988e+02 -2.47934443e+01 -1.59649438e+01 1.21518935e+02
1716.lowfreq: -19.6156 -3.8154 -0.0006 -0.0005 0.0007 5.5787 13.8679 23.7493 39.0518
frequency: 8.8727 23.7278 38.0123 57.6181 68.7180 81.3388 93.0602 122.4584 130.3478 155.6627 168.5130 212.0048 228.8265 267.1720 304.0836 331.9956 353.6954 397.8660 403.2554 408.7941 444.0550 476.2781 504.8602 546.4208 554.8310 577.1169 633.7764 646.2157 650.3177 724.5797 733.7829 751.3560 753.0054 773.3010 810.9411 836.3074 837.3951 847.9234 849.8600 865.3970 897.7513 952.4303 958.6798 972.2380 973.8093 980.0863 994.8004 998.5887 1012.6864 1025.2464 1044.3645 1070.5200 1075.4143 1109.9072 1124.0215 1132.5363 1191.4833 1194.9670 1196.0410 1212.5016 1226.1131 1240.8814 1253.6166 1283.9910 1289.8724 1293.8397 1300.5797 1304.9235 1311.9044 1337.2808 1343.0000 1353.2355 1372.1661 1391.3113 1413.8522 1419.7203 1463.7746 1464.7188 1473.5253 1477.7066 1482.4933 1486.7731 1488.4706 1522.7381 1548.2029 1575.6569 1614.8817 1623.5371 2174.1308 2953.2584 2965.8081 2970.7943 2973.2467 2980.1504 2992.2769 3012.8795 3027.8039 3048.6649 3069.5026 3072.8190 3117.3788 3119.0918 3139.4218 3141.7021 3143.3504 3148.3846 3162.9393 3167.6200
redmass: 2.9947 5.5646 1.9127 5.8965 3.6342 4.2159 2.5041 3.1051 2.6506 4.3889 5.5784 5.8692 1.1258 5.1076 3.6180 3.9861 3.3804 3.3910 2.8733 2.8721 4.0246 5.1209 6.0327 5.4881 3.8700 2.5390 6.8916 7.0812 4.8228 1.0679 3.7079 3.6116 1.1338 5.4921 3.7089 1.2447 1.6667 1.2511 1.2630 1.7769 1.8722 1.2319 1.3968 1.3761 1.3776 1.3814 6.5827 3.6010 2.9726 2.4404 3.1961 1.3453 2.3748 2.3020 1.4171 1.3128 1.4095 1.2842 1.5763 1.9545 1.9101 1.4174 1.2939 1.0732 1.1295 3.0844 1.4105 1.4061 1.3166 1.4250 2.6288 1.6207 6.0524 1.2158 3.4430 3.5970 1.0744 1.0787 1.0755 1.0425 1.0812 2.2840 1.1037 2.9728 6.2200 6.9869 6.1008 6.4254 12.6301 1.0589 1.0591 1.0581 1.0373 1.0591 1.0982 1.1011 1.1036 1.1048 1.1007 1.0993 1.0874 1.0876 1.0914 1.0887 1.0916 1.0958 1.0965 1.0978
irintensity: 0.0600 0.3810 0.2367 1.1039 0.2300 0.7159 0.6680 1.4794 1.1377 0.5006 2.0817 0.4090 0.0001 0.2934 0.1239 0.3504 0.0969 1.7343 0.1876 0.7374 0.1996 3.7949 2.7978 9.3460 19.3838 5.7504 0.2901 0.1410 1.0881 9.3446 3.7724 0.3168 0.2890 1.4207 14.5258 3.8974 97.8502 1.2848 0.5464 18.2271 2.7343 0.9057 0.2359 1.0264 0.9523 0.4452 11.0400 1.7388 0.1320 1.6441 1.9900 0.5673 0.4439 30.0764 6.1956 9.4258 4.7095 11.7784 0.3539 0.0530 0.0525 8.1047 0.1550 0.5243 0.6120 9.4339 1.8894 3.6052 0.0854 0.8158 0.7090 1.0138 0.9972 10.4363 4.9248 4.7730 0.1002 0.2410 2.4074 12.4811 0.1569 65.2982 27.1325 0.2767 0.2812 0.0009 105.1489 0.3278 82.8661 11.7997 11.2842 31.5559 40.4399 103.2388 1.0528 1.7538 9.6304 63.7157 91.3584 51.9153 4.9211 35.9873 8.6958 9.9015 20.3892 1.4242 15.4497 0.1182
temp: 298.150 k
press: 1.00000 atm
elementType: 7 6 6 6 6 6 6 6 6 6 6 6 6 6 6 6 6 6 6 1 1 1 1 1 1 1 1 1 1 1 1 1 1 1 1 1 1 1
symmnumber: 1
zpe: 828604.2 jmol-1
zpe.correction: 0.315599 hartree
zpe.thermalcorrener: 0.333882 hartree
zpe.thermalcorrenthalpy: 0.334826 hartree
zpe.thermalcorrgfe: 0.265710 hartree
zpe.sumelectzpe: -750.712108 hartree
zpe.sumelectthermal: -750.693824 hartree
zpe.sumelectthermalent: -750.692880 hartree
zpe.sumelectthermalfe: -750.761997 hartree
dipole: -6.3669 0.5569 0.6971
dipole: 6.4291
quadrupole: -160.9126 -103.9032 -115.7281
quadrupole: 4.3648 4.1584 -5.7007
quadrupole: -34.0646 22.9448 11.1198 4.3648 4.1584 -5.7007
hfenergy: -751.0277065 hartree
pointgroup: C01 [X(C18H19N1)]
dipole: 2.5069188 -0.1952514 0.2740879 debye
polarizability: 380.7871498|-13.4656207|166.4754352|24.2655667|12.9675697|119.2278566 unknown
InChI: InChI=1S/C18H19N/c1-2-3-4-5-15-6-10-17(11-7-15)18-12-8-16(14-19)9-13-18/h6-13H,2-5H2,1H3
charge 0 multiplicity 1
38 atoms
N  -7.487466 0.493254 -0.690539
C  4.513677 0.114195 -0.199802
C  3.72527 -0.628827 0.916991
C  6.044538 -0.003309 -0.032573
C  2.220665 -0.50637 0.743939
C  6.833555 0.735688 -1.137712
C  1.493978 -1.441739 -0.037891
C  1.501282 0.574215 1.317631
C  -0.613224 -0.217238 0.329208
C  8.363329 0.610611 -0.970063
C  0.10691 -1.302857 -0.242012
C  0.114439 0.71872 1.11545
C  -2.078258 -0.067027 0.11396
C  -2.919751 -1.205205 -0.04527
C  -2.684893 1.220604 0.05819
C  -4.303249 -1.069532 -0.252949
C  -4.067476 1.370315 -0.145748
C  -4.894558 0.22357 -0.305125
C  -6.309993 0.369759 -0.516066
H  4.218572 1.183028 -0.201349
H  4.213619 -0.292404 -1.18677
H  4.031116 -0.216177 1.898444
H  4.023907 -1.695514 0.909122
H  6.339758 0.399014 0.95934
H  6.334331 -1.075215 -0.031072
H  6.546216 1.80691 -1.136121
H  6.534273 0.335739 -2.127937
H  2.025347 -2.285548 -0.495333
H  2.034621 1.302323 1.941231
H  8.680284 -0.449015 -0.999955
H  8.903764 1.147385 -1.771141
H  8.691681 1.030848 -0.000651
H  -0.41702 -2.026691 -0.876497
H  -0.416033 1.544612 1.602993
H  -2.48869 -2.209387 0.024363
H  -2.059925 2.115496 0.14574
H  -4.935503 -1.955912 -0.365186
H  -4.51489 2.368077 -0.194043
