program: Gaussian 09
title: 000092301
version: EM64L-G09RevD.01
frameworkgroup: C1[X(C10H16O)]
method: RPBEPBE
basis: SDD
operation: Freq
keyword: #pfreq=noraman
keyword: PBEPBE/SDD
title: #p freq=noraman PBEPBE/SDD
converged: YES YES NO NO
title: Mulliken charges:
elementType: O C C C C C C C C C C H H H H H H H H H H H H H H H H
charge: -0.450390 -0.136764 -0.597601 -0.359310 0.365092 0.601035 -0.782496 -0.792053 -0.215261 -0.725157 -0.595458 0.224345 0.231034 0.221037 0.252683 0.218134 0.219234 0.232743 0.224907 0.231590 0.221219 0.336838 0.207986 0.230116 0.212650 0.209584 0.214263
chargesum: 0.00000
title: Mulliken charges with hydrogens summed into heavy atoms:
elementType: O C C C C C C C C C C
charge: -0.113552 0.087581 -0.145530 -0.106627 0.365092 0.601035 -0.112384 -0.114338 -0.007276 -0.282392 -0.171610
polarizability: 1.44862568e+02 -2.62701416e+01 1.28596027e+02 5.08937583e+00 3.42839434e+00 7.57756420e+01
1716.lowfreq: 0.0006 0.0007 0.0008 1.0406 6.8339 13.3296 33.5845 36.1189 63.8337
frequency: 33.1771 36.1086 63.8165 94.7446 133.9999 147.7972 169.7023 183.9352 206.1627 265.5370 292.5988 312.3235 378.6821 397.0560 418.9629 445.3580 462.8538 493.5027 520.5822 550.7533 674.6746 767.6485 790.3178 827.3893 847.4149 866.2844 920.5490 947.3666 948.9269 962.6796 985.6523 994.8645 1004.8731 1008.8350 1034.1131 1051.5278 1082.4342 1123.9681 1162.5764 1203.0196 1247.5611 1271.5921 1292.5261 1299.1320 1331.0027 1342.2377 1365.2217 1389.5497 1400.5785 1413.7798 1437.2347 1455.0531 1465.3724 1469.6685 1473.5189 1474.5459 1608.7948 1648.8945 1685.2588 2960.3190 2966.5985 2995.8005 3004.7584 3031.5803 3035.7182 3066.2610 3081.8683 3084.4216 3086.9803 3092.9357 3094.3365 3101.0176 3200.2674 3203.4425 3555.1470
redmass: 3.7882 3.0174 3.4148 2.8997 1.0243 3.5972 2.0982 1.1934 3.2503 2.3177 2.2504 1.4199 2.6623 2.6293 1.9733 2.1574 2.7749 2.5685 2.4489 2.0553 1.4914 1.5619 2.9030 3.0669 2.8381 1.4433 1.3433 1.3780 1.3845 1.7128 2.2358 1.2521 1.4903 1.7712 1.8579 1.4982 1.6775 2.3096 1.2264 1.7379 1.2268 1.4870 1.3958 1.2770 2.1453 1.4388 1.5923 1.2646 1.2159 1.3449 1.1756 1.0502 1.0488 1.1265 1.0451 1.0911 3.7296 4.8509 6.3401 1.0376 1.0386 1.0813 1.0624 1.0969 1.0962 1.1011 1.0934 1.0796 1.0935 1.0631 1.0964 1.0719 1.1140 1.1132 1.0661
irintensity: 0.6072 0.3294 1.3195 0.0909 0.0797 0.3195 0.6578 2.0843 2.7764 17.4985 26.4306 96.5228 2.8968 14.2508 4.3265 7.7877 1.7073 3.0859 7.3031 8.6222 8.1254 0.8670 0.5371 5.9629 32.1626 10.2297 81.4904 1.7897 44.5695 6.9582 23.8515 9.4629 64.9427 20.8254 14.2299 7.6540 3.6746 9.5293 7.7483 15.6936 37.1255 7.5956 2.2705 0.1039 4.7508 18.7672 7.9225 24.6902 14.3537 6.1117 6.1758 3.8024 11.9819 8.6909 26.5049 12.2045 31.7695 4.2373 12.9302 33.0572 44.0468 19.2319 28.8067 4.9983 44.4800 15.7723 2.6748 20.9572 43.6968 17.0498 34.6130 3.6582 25.1449 25.8709 4.0463
temp: 298.150 k
press: 1.00000 atm
elementType: 8 6 6 6 6 6 6 6 6 6 6 1 1 1 1 1 1 1 1 1 1 1 1 1 1 1 1
symmnumber: 1
zpe: 606780.3 jmol-1
zpe.correction: 0.231110 hartree
zpe.thermalcorrener: 0.244788 hartree
zpe.thermalcorrenthalpy: 0.245732 hartree
zpe.thermalcorrgfe: 0.190206 hartree
zpe.sumelectzpe: -464.955261 hartree
zpe.sumelectthermal: -464.941584 hartree
zpe.sumelectthermalent: -464.940639 hartree
zpe.sumelectthermalfe: -464.996166 hartree
dipole: -2.2379 1.1194 0.3177
dipole: 2.5223
quadrupole: -62.7447 -68.1455 -68.8766
quadrupole: 1.0461 0.1721 1.4395
quadrupole: 3.8442 -1.5566 -2.2876 1.0461 0.1721 1.4395
hfenergy: -465.1863717 hartree
pointgroup: C01 [X(C10H16O1)]
dipole: -0.8480708 0.4958975 0.1401354 debye
polarizability: 141.5796287|-27.0498684|132.0235869|4.1490881|3.6545061|75.6310212 unknown
InChI: InChI=1S/C10H16O/c1-5-9(4)7-10(11)6-8(2)3/h5-6,10-11H,1,4,7H2,2-3H3
charge 0 multiplicity 1
27 atoms
O  0.092081 -1.894495 1.004364
C  -0.189625 -0.614704 0.297407
C  0.867002 -0.546661 -0.836385
C  -1.605355 -0.627161 -0.232822
C  -2.592604 0.287527 -0.000428
C  2.275777 -0.267586 -0.330921
C  -3.975011 0.10723 -0.607055
C  -2.435041 1.542127 0.843107
C  2.659164 1.117671 0.011525
C  3.187434 -1.274367 -0.176402
C  1.887297 2.236063 -0.117817
H  -0.031093 0.228838 0.997396
H  0.837228 -1.516017 -1.366105
H  0.553538 0.23308 -1.555413
H  -1.833128 -1.497525 -0.867724
H  -4.749481 0.053729 0.184017
H  -4.241775 0.96918 -1.250616
H  -4.041051 -0.80992 -1.217188
H  -2.573082 2.447189 0.21843
H  -1.450919 1.620544 1.332772
H  -3.215868 1.581621 1.627875
H  -0.61956 -2.032321 1.680671
H  3.679594 1.232734 0.408635
H  2.935188 -2.314962 -0.40381
H  4.198886 -1.078366 0.201972
H  2.270252 3.223709 0.160697
H  0.864851 2.202644 -0.512382
