program: Gaussian 09
title: 000092343
version: EM64L-G09RevD.01
frameworkgroup: C1[X(C14H16N2S2)]
method: RPBEPBE
basis: SDD
operation: Freq
keyword: #p
keyword: freq=noraman
keyword: PBEPBE/SDD
title: #p freq=noraman PBEPBE/SDD
converged: YES YES NO NO
title: Mulliken charges:
elementType: S S N N C C C C C C C C C C C C C C H H H H H H H H H H H H H H H H
charge: 0.142350 0.142349 -0.676321 -0.676317 -0.610462 -0.610449 -0.351519 -0.351520 0.498698 0.498685 -0.230226 -0.230216 -0.390543 -0.390542 -0.266671 -0.266672 -0.198557 -0.198557 0.280576 0.271213 0.280577 0.271209 0.247151 0.247151 0.217798 0.217798 0.227782 0.227782 0.222257 0.222256 0.302354 0.314118 0.302353 0.314117
chargesum: 0.00000
title: Mulliken charges with hydrogens summed into heavy atoms:
elementType: S S N N C C C C C C C C C C C C C C
charge: 0.142350 0.142349 -0.059849 -0.059848 -0.058673 -0.058664 -0.351519 -0.351520 0.498698 0.498685 0.016925 0.016934 -0.172745 -0.172743 -0.038890 -0.038890 0.023700 0.023700
polarizability: 3.05898712e+02 -1.51850842e+01 2.00834128e+02 -3.41828420e+01 -1.49463460e+00 1.22466491e+02
1716.lowfreq: -6.0763 -0.0028 -0.0025 0.0011 4.7609 15.3276 15.8966 24.9128 29.2906
frequency: 15.8965 24.9128 28.7424 33.7057 54.3022 70.5248 99.2745 149.7847 150.7386 216.3199 217.9313 254.1939 254.9479 279.5574 298.5319 371.6062 374.8172 392.9005 394.0512 447.1892 448.5688 454.0433 465.0848 538.7435 540.1256 547.5092 548.5369 561.1263 561.8837 624.6005 661.3052 662.5176 710.9823 730.5360 742.7311 754.0758 754.1986 773.5715 827.8521 827.9664 846.9613 847.0783 940.2306 940.3445 950.0696 970.5161 970.5240 1000.4193 1000.5295 1035.8875 1036.0727 1042.5274 1043.6433 1058.3278 1101.1910 1135.5067 1135.5782 1169.9064 1169.9991 1225.8373 1257.6746 1264.3591 1265.4662 1282.5869 1322.3197 1322.4658 1383.3079 1383.5386 1441.4296 1441.5219 1458.7724 1460.4501 1481.1044 1481.7051 1572.2112 1572.2350 1595.4073 1595.6195 1623.0933 1623.6107 3028.9045 3035.6962 3095.4853 3117.2275 3117.2320 3120.5180 3135.9325 3135.9357 3144.6128 3144.6249 3167.9197 3167.9963 3505.3998 3505.4116 3676.0055 3676.0731
redmass: 5.6049 4.5809 4.9664 6.0785 5.8841 2.1043 3.7361 4.6868 4.7345 4.2815 7.3292 5.8549 5.9705 4.5436 4.2786 5.7384 4.7942 1.1617 1.1520 3.3212 3.1986 3.9450 3.7041 2.0240 2.0144 6.5040 5.9089 1.4909 1.4057 8.7100 6.5249 6.5540 3.5809 2.6450 3.5453 1.4393 1.4444 1.1135 5.1536 5.1694 1.4866 1.4928 1.3658 1.3656 1.3221 1.3172 1.3172 2.8719 2.8706 2.3245 2.2658 2.0980 2.0192 3.8467 1.0408 1.3260 1.3273 1.0552 1.0551 1.1563 1.2409 1.6156 1.5313 1.2281 1.9045 1.9030 7.5703 7.5654 2.5573 2.5649 1.1227 1.1072 2.9288 2.8220 6.3143 6.2972 1.6435 1.6489 2.5777 2.6033 1.0582 1.0550 1.1085 1.0865 1.0865 1.1101 1.0887 1.0887 1.0941 1.0941 1.1001 1.1001 1.0479 1.0479 1.1002 1.1002
irintensity: 0.4086 0.9784 0.0000 0.2275 0.0000 0.0000 3.0788 0.0000 1.5022 4.7879 0.0000 0.0001 8.3477 0.0000 30.6859 0.0000 4.1539 0.0000 304.2479 19.8674 0.0000 0.0000 22.7392 0.0036 82.7991 0.0000 1.0533 130.6825 0.0412 2.8657 0.0000 11.7365 0.0000 10.1010 0.0000 0.0018 189.0534 5.6089 10.8674 0.0002 7.4979 0.0003 0.0002 5.0138 0.0000 0.0000 0.3803 0.0000 12.7689 0.0001 8.2167 0.0000 48.6693 0.0000 2.8583 22.9103 0.0006 13.1028 0.0000 14.2519 0.0000 16.3273 0.0000 0.0000 30.3857 0.0010 43.6203 0.0002 16.5139 0.0001 0.0000 7.6367 138.7107 0.0003 0.0041 9.0422 47.2093 0.0001 0.0006 435.1374 0.0000 17.9926 0.0000 17.2762 1.4823 12.5509 13.1850 0.6347 53.6279 0.0019 53.4837 0.0100 10.9862 87.3232 85.6539 0.0350
temp: 298.150 k
press: 1.00000 atm
elementType: 16 16 7 7 6 6 6 6 6 6 6 6 6 6 6 6 6 6 1 1 1 1 1 1 1 1 1 1 1 1 1 1 1 1
symmnumber: 1
zpe: 706340.4 jmol-1
zpe.correction: 0.269031 hartree
zpe.thermalcorrener: 0.287403 hartree
zpe.thermalcorrenthalpy: 0.288347 hartree
zpe.thermalcorrgfe: 0.219135 hartree
zpe.sumelectzpe: -1447.415468 hartree
zpe.sumelectthermal: -1447.397097 hartree
zpe.sumelectthermalent: -1447.396153 hartree
zpe.sumelectthermalfe: -1447.465365 hartree
dipole: -0.0002 0.0000 -0.0002
dipole: 0.0003
quadrupole: -112.3452 -100.4077 -130.9066
quadrupole: 13.0478 -10.1814 2.5645
quadrupole: 2.2080 14.1455 -16.3535 13.0478 -10.1814 2.5645
hfenergy: -1447.6844992 hartree
pointgroup: C01 [X(C14H16N2S2)]
dipole: 0.0000719 -0.0000233 0.000087 debye
polarizability: 303.6996153|31.1140582|197.5496198|-24.6163649|21.5679091|127.9500955 unknown
InChI: InChI=1S/C14H16N2S2/c15-11-5-1-3-7-13(11)17-9-10-18-14-8-4-2-6-12(14)16/h1-8H,9-10,15-16H2
charge 0 multiplicity 1
34 atoms
S  -1.790593 -0.046002 -1.419505
S  1.790407 0.046914 1.41948
N  -3.53167 1.950819 0.139752
N  3.531694 -1.94996 -0.139481
C  -0.703716 -0.252597 0.15323
C  0.703544 0.253459 -0.15327
C  -3.446949 -0.363853 -0.666726
C  3.446754 0.364809 0.666699
C  -4.120991 0.696149 0.022833
C  4.120903 -0.695222 -0.022712
C  -4.049211 -1.633079 -0.794999
C  4.048906 1.6341 0.794835
C  -5.401306 0.421776 0.59057
C  5.4012 -0.420804 -0.590468
C  -5.321762 -1.890201 -0.2360
C  5.321447 1.891263 0.235831
C  -5.986206 -0.852479 0.461697
C  5.985985 0.853519 -0.461744
H  -1.1877 0.3274 0.95676
H  -0.710198 -1.322534 0.416416
H  1.187539 -0.32655 -0.956787
H  0.71002 1.323392 -0.416474
H  -3.5111 -2.417595 -1.337841
H  3.510716 2.418637 1.337567
H  -5.931165 1.219298 1.125912
H  5.931137 -1.218344 -1.125706
H  -5.782389 -2.877315 -0.341445
H  5.781989 2.878428 0.341167
H  -6.972107 -1.036006 0.904549
H  6.971877 1.037079 -0.904604
H  -4.027855 2.71866 0.582531
H  -2.687404 2.140532 -0.401901
H  4.027946 -2.717808 -0.582173
H  2.687454 -2.139687 0.402209
