program: Gaussian 09
title: 000092325
version: EM64L-G09RevD.01
frameworkgroup: C1[X(C11H12O4)]
method: RPBEPBE
basis: SDD
operation: Freq
keyword: #pfreq=noraman
keyword: PBEPBE/SDD
title: #p freq=noraman PBEPBE/SDD
converged: YES YES NO NO
title: Mulliken charges:
elementType: O O O O C C C C C C C C C C C H H H H H H H H H H H H
charge: -0.276212 -0.268170 -0.225719 -0.262979 -0.270724 -0.225309 0.497409 0.274235 -0.387432 -0.364296 -0.354156 -0.354384 0.322529 -0.503409 -0.537834 0.263100 0.265246 0.237156 0.255987 0.253057 0.241969 0.243098 0.236890 0.247336 0.223415 0.222186 0.247013
chargesum: 0.00000
title: Mulliken charges with hydrogens summed into heavy atoms:
elementType: O O O O C C C C C C C C C C C
charge: -0.276212 -0.268170 -0.225719 -0.262979 -0.007625 0.039937 0.497409 0.274235 -0.150276 -0.108309 -0.101099 -0.112415 0.322529 0.223915 0.154779
polarizability: 2.12115420e+02 4.42711330e+00 1.16433886e+02 4.40175086e+00 -7.44622399e+00 8.66462260e+01
1716.lowfreq: -0.0012 -0.0011 -0.0001 1.7850 4.4662 9.1667 29.9952 37.2617 58.7823
frequency: 29.8919 37.2595 58.7803 74.9151 92.5852 105.4242 149.0604 164.6022 185.3493 226.4734 244.7817 267.1226 305.5918 317.9538 383.2899 413.7185 428.9088 477.7841 527.5210 537.2871 623.7513 649.6528 688.1711 723.4886 742.7079 757.2582 811.6852 818.6900 832.6403 833.7834 876.3022 943.2556 962.3085 962.7079 986.6237 1002.6097 1056.9647 1090.4035 1112.1227 1112.5853 1113.9541 1136.4400 1149.0804 1156.3132 1174.8047 1183.9517 1229.2245 1242.2868 1299.6065 1315.0653 1369.6478 1401.7050 1422.9328 1428.4419 1437.3415 1452.6009 1462.6007 1467.2274 1472.5730 1508.0507 1583.3125 1625.9708 1644.6167 2961.1015 3006.7271 3049.9522 3097.4308 3109.1982 3127.1401 3128.7409 3136.1444 3138.8079 3154.1563 3165.0175 3170.3602
redmass: 4.2495 4.6021 5.4483 3.0340 1.2049 3.6555 4.8594 3.8739 4.1528 1.3961 3.2856 3.7108 5.9539 5.1137 7.0263 2.9906 4.8226 4.2338 3.9358 3.2939 7.0810 6.7060 5.6844 4.1345 5.3600 6.3844 5.7790 1.3444 3.4110 2.1787 4.8161 1.4476 1.3764 4.5198 8.6993 2.6234 1.3062 1.2464 1.3538 1.2597 1.2893 3.7034 1.4643 1.3551 1.4542 1.7813 2.2629 1.9180 1.5774 1.4407 3.5524 3.3290 1.2709 2.7342 1.1752 1.0493 1.0516 1.0502 1.0728 2.6743 7.0743 6.3477 9.8224 1.0330 1.0296 1.1041 1.0899 1.1046 1.0993 1.0896 1.0904 1.0885 1.1049 1.0946 1.0954
irintensity: 1.1489 2.2053 0.5665 1.1481 0.2571 7.0218 4.1481 2.7594 2.5339 2.8101 4.1807 8.9593 6.7912 9.2022 2.0643 0.3133 2.2020 0.3682 33.8998 30.1167 0.9434 6.8628 13.8627 5.2930 13.5846 14.9922 37.6684 9.4312 42.2554 20.3122 1.5305 2.0380 1.4695 40.6195 40.5466 4.3634 4.4084 4.2558 12.4268 0.1941 5.8093 376.9844 36.9815 3.9326 23.5789 34.7065 120.5663 71.5429 15.1328 20.5976 111.0552 38.5608 20.7973 50.9415 5.3522 15.5874 11.4977 14.1151 41.8429 82.0477 13.6517 90.7923 163.4932 66.8905 33.2599 47.4892 5.2245 24.2168 26.4734 11.0558 8.1778 3.5851 15.0893 12.5386 5.2378
temp: 298.150 k
press: 1.00000 atm
elementType: 8 8 8 8 6 6 6 6 6 6 6 6 6 6 6 1 1 1 1 1 1 1 1 1 1 1 1
symmnumber: 1
zpe: 545129.5 jmol-1
zpe.correction: 0.207629 hartree
zpe.thermalcorrener: 0.222550 hartree
zpe.thermalcorrenthalpy: 0.223494 hartree
zpe.thermalcorrgfe: 0.163805 hartree
zpe.sumelectzpe: -726.090723 hartree
zpe.sumelectthermal: -726.075802 hartree
zpe.sumelectthermalent: -726.074857 hartree
zpe.sumelectthermalfe: -726.134546 hartree
dipole: -1.3759 -2.4729 -2.4642
dipole: 3.7524
quadrupole: -66.9884 -82.9556 -93.0227
quadrupole: 2.2744 -11.5267 -2.7601
quadrupole: 14.0005 -1.9667 -12.0338 2.2744 -11.5267 -2.7601
hfenergy: -726.2983518 hartree
pointgroup: C01 [X(C11H12O4)]
dipole: 0.5648169 0.4675133 1.2813524 debye
polarizability: 212.2156333|-1.3618884|97.2300762|4.5934444|-16.2498462|105.749822 unknown
InChI: InChI=1S/C11H12O4/c1-13-8-5-3-7(4-6-8)9-10(15-9)11(12)14-2/h3-6,9-10H,1-2H3
charge 0 multiplicity 1
27 atoms
O  -1.566466 -1.547867 -0.825109
O  -3.943662 0.458065 1.010078
O  -3.896915 0.353295 -1.325072
O  4.657077 0.557606 -0.09598
C  -0.92925 -0.203879 -1.097247
C  -1.955692 -0.353004 0.006915
C  0.525886 -0.052692 -0.81354
C  -3.344194 0.170565 -0.217647
C  1.269997 0.955839 -1.482574
C  1.193341 -0.890049 0.111955
C  2.638556 1.136256 -1.220106
C  2.56813 -0.725901 0.381997
C  3.292717 0.297035 -0.282794
C  -5.318188 1.013367 0.93478
C  5.387272 -0.287978 0.852347
H  -1.305579 0.256251 -2.021469
H  -1.619571 -0.390191 1.048789
H  0.773006 1.60476 -2.213858
H  0.635562 -1.699834 0.595939
H  3.221881 1.909812 -1.728219
H  3.060041 -1.394636 1.094521
H  -5.316168 1.959619 0.36794
H  -5.613039 1.176202 1.98038
H  -5.989255 0.293689 0.437052
H  5.373811 -1.34957 0.53783
H  4.9719 -0.197365 1.874838
H  6.419802 0.090105 0.836955
