program: Gaussian 09
title: 000092298
version: EM64L-G09RevD.01
frameworkgroup: C1[X(C8H4F3NO2)]
method: RPBEPBE
basis: SDD
operation: Freq
keyword: #p
keyword: freq=noraman
keyword: PBEPBE/SDD
title: #p freq=noraman PBEPBE/SDD
converged: NO NO NO NO
title: Mulliken charges:
elementType: F F F O O N C C C C C C C C H H H H
charge: -0.158906 -0.124963 -0.168787 -0.242579 -0.167747 0.072076 0.355431 -0.283830 -0.329271 0.385287 -0.351542 -0.344596 0.401825 -0.112923 0.277436 0.272714 0.259155 0.261218
chargesum: 0.00000
title: Mulliken charges with hydrogens summed into heavy atoms:
elementType: F F F O O N C C C C C C C C
charge: -0.158906 -0.124963 -0.168787 -0.242579 -0.167747 0.072076 0.355431 -0.006394 -0.056556 0.385287 -0.092387 -0.083378 0.401825 -0.112923
polarizability: 1.85691885e+02 7.09721528e+00 8.74926982e+01 -6.69647422e+00 1.95192815e+00 4.57464706e+01
1716.lowfreq: -46.1736 -16.0121 -5.3796 -5.0028 -0.0007 0.0005 0.0009 14.7282 39.2410
frequency: -46.1681 14.4687 39.2318 73.9451 108.4841 172.9969 260.5193 280.4683 338.8996 382.9448 408.2013 412.1274 426.5803 475.8707 487.4834 491.8701 512.2137 531.9566 590.1291 634.7625 673.6086 716.3519 749.3598 821.2360 844.4025 850.8433 955.2082 966.1890 986.5541 1003.0245 1067.1432 1099.6675 1111.6557 1151.2653 1169.9696 1190.1823 1300.0356 1361.4093 1420.3121 1444.2396 1542.5334 1586.1639 1622.2449 2397.7541 3163.0454 3167.5178 3184.7543 3188.0849
redmass: 11.5498 5.6334 12.8430 12.9535 11.8461 10.2063 10.6203 13.4521 9.3024 10.4357 7.5359 3.2471 6.8936 11.1010 12.4252 11.1957 2.9524 14.9559 9.7301 7.9312 8.0855 3.8809 8.9079 1.2463 1.6338 8.4950 1.3755 1.3605 11.0326 3.1715 10.9118 3.6846 1.4132 4.2600 3.1879 1.4633 1.2833 6.3223 3.6083 2.7847 5.9585 7.8176 6.7686 12.7442 1.0902 1.0892 1.0967 1.0981
irintensity: 0.2304 0.2621 0.6929 0.4250 1.1692 1.3755 5.1371 1.5682 0.7239 1.9956 0.9946 0.8088 7.3788 9.5416 18.8338 13.8992 23.2512 1.7813 4.7902 0.9135 6.3673 0.6166 9.8592 0.0968 82.1107 31.9156 4.4650 2.2866 336.3235 26.7836 272.5806 181.0634 27.6579 366.6039 644.0980 74.6627 1.3399 7.7942 1.0399 128.9003 59.8279 0.1158 4.7221 1602.9899 3.8162 4.4012 0.3586 0.5487
temp: 298.150 k
press: 1.00000 atm
elementType: 9 9 9 8 8 7 6 6 6 6 6 6 6 6 1 1 1 1
symmnumber: 1
zpe: 283382.8 jmol-1
zpe.correction: 0.107935 hartree
zpe.thermalcorrener: 0.119443 hartree
zpe.thermalcorrenthalpy: 0.120387 hartree
zpe.thermalcorrgfe: 0.067751 hartree
zpe.sumelectzpe: -810.968200 hartree
zpe.sumelectthermal: -810.956692 hartree
zpe.sumelectthermalent: -810.955748 hartree
zpe.sumelectthermalfe: -811.008384 hartree
dipole: -0.2446 0.6296 -0.3468
dipole: 0.7593
quadrupole: -106.9338 -70.0120 -80.4537
quadrupole: -2.4313 0.9280 1.1877
quadrupole: -21.1340 15.7879 5.3461 -2.4313 0.9280 1.1877
hfenergy: -811.0761348 hartree
pointgroup: C01[X(C8H4F3N1O2)]
dipole: 0.0984945 -0.277526 0.0501634 debye
dipolederiv: -0.4667711 -0.0308581 -0.0409655 0.2433926 -0.6837907 -0.2784282 0.0312274 -0.2551619 -0.4739951 -1.0098491 -0.1796589 0.1077742 -0.1467123 -0.3603379 0.0424198 0.1360464 0.0481201 -0.321877 -0.5275176 0.0451743 -0.0716734 0.1903472 -0.3712597 0.1544666 -0.230273 0.151605 -0.7902022 -2.2238375 0.177872 -0.0312559 0.512575 -0.4893726 0.0323501 -0.2403478 -0.0005367 -0.3928151 -2.0273932 -0.2437546 0.0280971 -0.2796273 -0.3064141 0.0037782 0.0186929 0.0020081 -0.2683101 -2.4022684 -0.2970465 0.0239606 -0.3327616 -0.2987963 0.0558002 0.0217749 0.0552341 -0.2437867 1.4775353 0.015175 0.0101965 0.2158704 0.0708515 -0.046004 0.007126 -0.0069901 0.1210425 -0.1768041 0.0039109 0.0065525 -0.149148 -0.0793387 -0.0378687 0.0835146 -0.0407463 -0.0756093 -0.1997961 0.0220504 0.0080384 0.1229164 -0.0279028 -0.0728199 -0.0620393 -0.0833615 -0.0523918 1.5085446 0.1970366 -0.0213703 0.2047462 0.1642934 -0.0190369 -0.0067583 -0.0220465 0.1236593 -0.2070138 -0.0215647 0.0239196 0.0992698 -0.0233195 -0.1119367 -0.1016501 -0.120669 -0.0496029 -0.1419053 -0.0197229 0.0207133 -0.1446633 -0.0703163 -0.0989619 0.1341268 -0.085551 -0.0634585 2.863889 -0.0693871 0.0219825 -0.9831172 1.7158216 0.0818196 0.2816299 0.0596972 1.7503409 3.3037907 0.4182094 -0.0436587 0.4685215 0.4040017 -0.0114964 -0.0352881 -0.0099113 0.3380945 0.0729209 0.0258569 -0.0443992 0.0382581 0.1123662 0.0558872 -0.0528528 0.0584269 0.1131299 0.0784838 -0.0453005 0.0278482 -0.0536872 0.0874485 0.0789539 0.0383966 0.0817813 0.1028081 0.0543496 -0.046297 0.0326191 -0.0478282 0.064802 0.0936053 0.0364569 0.0910247 0.088731 0.0236421 0.0483047 -0.0583791 0.0416477 0.0912636 0.0774717 -0.059783 0.0770766 0.0942426 unknown
polarizability: 185.4993684|10.8548652|69.2464331|1.4501533|-20.7670611|64.1852526 unknown
InChI: InChI=1S/C8H4F3NO2/c9-8(10,11)14-7-3-1-6(2-4-7)12-5-13/h1-4H
charge 0 multiplicity 1
18 atoms
F  -3.015966 1.22952 0.698458
F  -4.451226 -0.487607 0.281469
F  -3.354185 0.520008 -1.428913
O  -2.258005 -0.895169 0.084225
O  5.676961 0.453691 -0.121596
N  3.278036 0.080243 -0.089397
C  -0.855758 -0.555507 0.008892
C  -0.343216 0.431765 -0.856697
C  -0.021081 -1.342667 0.821396
C  1.914604 -0.128639 -0.06864
C  1.049891 0.64823 -0.884497
C  1.368611 -1.130644 0.781191
C  -3.22695 0.065732 -0.082392
C  4.470971 0.263004 -0.107558
H  -1.001082 1.022644 -1.498777
H  -0.461833 -2.101138 1.473536
H  1.473011 1.414049 -1.54152
H  2.037018 -1.728014 1.406921
