program: Gaussian 09
title: 000092286
version: EM64L-G09RevD.01
frameworkgroup: C1[X(C3H8O2)]
method: RPBEPBE
basis: SDD
operation: Freq
keyword: #p
keyword: freq=noraman
keyword: PBEPBE/SDD
title: #p freq=noraman PBEPBE/SDD
converged: NO YES NO NO
title: Mulliken charges:
elementType: O O C C C H H H H H H H H
charge: -0.441695 -0.441687 0.200638 -0.683479 -0.683485 0.220765 0.226857 0.231753 0.220765 0.231757 0.226856 0.345478 0.345478
chargesum: 0.00000
title: Mulliken charges with hydrogens summed into heavy atoms:
elementType: O O C C C
charge: -0.096217 -0.096208 0.200638 -0.004105 -0.004107
polarizability: 4.24126733e+01 2.86376412e-04 4.06078201e+01 9.04030457e-01 6.18505263e-05 3.95047626e+01
1716.lowfreq: -23.0399 -12.2285 -10.8995 -0.0010 -0.0007 -0.0003 183.6041 227.3397 309.1606
frequency: 183.5250 227.3224 309.1599 343.5561 348.4136 422.3412 424.9956 475.4824 533.6079 740.8458 819.2139 927.6703 938.0842 993.4039 1070.6502 1136.6179 1170.0516 1298.7067 1362.3082 1392.4174 1398.2926 1451.6388 1458.2374 1474.0984 1476.1667 2996.9131 3000.6405 3094.7421 3098.8221 3111.3334 3117.9668 3543.3076 3543.7345
redmass: 1.0203 1.0654 2.3040 2.9920 1.0778 2.5838 1.4595 2.8830 2.2093 5.1938 3.4860 1.4676 2.2013 1.3069 1.4504 1.4727 2.1757 1.6959 1.4004 1.7183 1.2474 1.0484 1.1035 1.0660 1.0490 1.0359 1.0367 1.0992 1.0984 1.1011 1.1005 1.0654 1.0649
irintensity: 0.2308 5.3653 1.2482 1.3648 154.9012 1.4450 41.9955 23.3022 134.8595 10.1366 87.2019 0.6999 51.1298 0.1806 59.3077 121.7843 129.5445 2.1407 19.8580 94.0601 19.0968 0.4637 7.5212 4.5909 9.5560 22.8457 2.9706 13.5903 37.6628 1.9596 39.9338 5.2201 1.6458
temp: 298.150 k
press: 1.00000 atm
elementType: 8 8 6 6 6 1 1 1 1 1 1 1 1
symmnumber: 1
zpe: 286411.5 jmol-1
zpe.correction: 0.109088 hartree
zpe.thermalcorrener: 0.115615 hartree
zpe.thermalcorrenthalpy: 0.116559 hartree
zpe.thermalcorrgfe: 0.080186 hartree
zpe.sumelectzpe: -269.127700 hartree
zpe.sumelectthermal: -269.121174 hartree
zpe.sumelectthermalent: -269.120230 hartree
zpe.sumelectthermalfe: -269.156602 hartree
dipole: 0.0001 0.2925 0.0001
dipole: 0.2925
quadrupole: -29.2980 -28.8016 -35.1575
quadrupole: 0.0004 4.4377 -0.0003
quadrupole: 1.7877 2.2841 -4.0718 0.0004 4.4377 -0.0003
hfenergy: -269.2367884 hartree
pointgroup: C01 [X(C3H8O2)]
dipole: -0.0000529 0.1150676 -0.0002966 debye
dipolederiv: -0.3021793 -0.1528196 -0.0081445 -0.1781117 -0.6940569 0.2297743 -0.0489337 0.0988841 -0.8908255 -0.3023009 0.1529316 -0.0087273 0.1780395 -0.6954326 -0.2306671 -0.0496998 -0.099793 -0.8893031 0.6257243 -0.0000264 0.01016 0.000102 0.9164733 0.0005174 0.0691248 0.0005274 1.1453956 -0.1760002 -0.1496939 -0.0057079 -0.0699472 -0.0745404 0.0080462 -0.0204272 0.0095954 -0.013859 -0.1761012 0.149613 -0.0063949 0.0698032 -0.0745148 -0.0077669 -0.0207487 -0.009322 -0.0137809 0.0859373 0.0092972 0.0308761 -0.0118083 0.0227133 -0.1017142 -0.0039156 -0.1195235 -0.0604404 -0.0737149 0.0907776 -0.0185887 0.1322383 -0.0044932 0.0206754 -0.022352 0.015713 0.108015 0.0961331 -0.0221178 0.0020155 -0.0346475 0.0052553 0.1101114 0.0264235 0.126905 -0.0378172 0.0859345 -0.0091208 0.0308701 0.01182 0.0237369 0.1013382 -0.0040263 0.1191321 -0.0614684 0.0961073 0.0221708 0.0019664 0.0348136 0.0041847 -0.1103049 0.0263227 -0.127085 -0.0367115 -0.0736063 -0.0908952 -0.0181575 -0.132374 -0.0047697 -0.0201645 -0.0217342 -0.0152046 0.1081791 0.0569735 0.1734024 -0.0054849 0.1421094 0.2879513 0.0406633 0.0346512 0.0322299 0.3211398 0.0570928 -0.1735188 -0.0046824 -0.1420371 0.2874929 -0.0405085 0.0353153 -0.0320588 0.3214767 unknown
polarizability: 42.2172661|0.002847|40.6078158|1.160735|-0.0019895|39.7001741 unknown
InChI: InChI=1S/C3H8O2/c1-3(2,4)5/h4-5H,1-2H3
charge 0 multiplicity 1
13 atoms
O  -0.231777 -0.784856 1.17932
O  0.232119 -0.790182 -1.175617
C  -0.000022 0.064046 -0.000118
C  1.281595 0.892702 0.141079
C  -1.282037 0.891444 -0.145143
H  1.240072 1.499691 1.060585
H  2.160014 0.224043 0.185914
H  1.408284 1.559438 -0.728046
H  -1.240807 1.49418 -1.067457
H  -1.409046 1.562149 0.720874
H  -2.160134 0.222161 -0.186878
H  0.585328 -1.327148 1.33304
H  -0.584788 -1.333469 -1.326851
