program: Gaussian 09
title: 000092326
version: EM64L-G09RevD.01
frameworkgroup: C1[X(C17H20N2O)]
method: RPBEPBE
basis: SDD
operation: Freq
keyword: #p
keyword: freq=noraman
keyword: PBEPBE/SDD
title: #p freq=noraman PBEPBE/SDD
converged: YES YES NO NO
title: Mulliken charges:
elementType: O N N C C C C C C C C C C C C C C C C C H H H H H H H H H H H H H H H H H H H H
charge: -0.283959 -0.479925 -0.258813 0.177201 0.503774 -0.716602 -0.753226 -0.393829 -0.384776 0.259274 -0.255161 -0.241574 0.406984 -0.244854 -0.708785 -0.325188 -0.379895 -0.226191 -0.231139 -0.254282 0.209175 0.288703 0.207366 0.224323 0.217726 0.236450 0.320164 0.220677 0.242881 0.221774 0.224369 0.226961 0.220792 0.253406 0.261432 0.304093 0.238220 0.224118 0.221681 0.226656
chargesum: 0.00000
title: Mulliken charges with hydrogens summed into heavy atoms:
elementType: O N N C C C C C C C C C C C C C C C C C
charge: -0.283959 -0.159761 -0.258813 0.177201 0.503774 -0.011358 -0.074726 -0.173151 -0.141896 0.259274 -0.033387 -0.017206 0.406984 -0.017894 0.026846 -0.021095 -0.141675 -0.002073 -0.009458 -0.027626
polarizability: 2.60329507e+02 1.65227526e+01 1.85298690e+02 -1.87327789e+01 6.51286861e+00 1.51478277e+02
1716.lowfreq: -13.5396 -5.6702 -4.8225 0.0006 0.0008 0.0008 17.4755 27.7989 30.3680
frequency: 16.9410 27.2973 30.0358 66.3551 72.6594 109.0278 127.9547 164.3592 196.8351 213.1906 218.4350 232.6972 259.3225 272.9295 280.0063 301.6311 318.2572 350.0589 359.2406 388.7818 401.0941 404.3854 414.5157 481.2088 515.0690 517.8982 543.9316 547.2993 585.7263 614.2864 617.4731 641.1903 698.1752 703.1029 709.9632 714.4485 764.5924 769.9428 781.1929 838.1176 847.9967 876.4292 907.6450 912.9573 919.2152 930.4590 968.7493 972.2443 982.8190 989.4418 990.2385 993.1376 993.3572 1018.4944 1027.1744 1030.9039 1083.1405 1085.1609 1098.7865 1104.9801 1113.5664 1151.4349 1166.2329 1172.3694 1174.1981 1193.9876 1196.9243 1205.5562 1237.2625 1252.5866 1306.3645 1317.1747 1331.3537 1374.3254 1378.9028 1379.1012 1393.1581 1432.9061 1439.1191 1442.4665 1453.3060 1464.0405 1472.4279 1476.8457 1479.7045 1485.1038 1492.5837 1495.7996 1499.7145 1584.0785 1591.9349 1606.6597 1612.3818 1619.2451 2941.6851 2975.9884 2996.6978 3052.2211 3068.7891 3088.4805 3099.1105 3102.5290 3117.7394 3123.6613 3125.4304 3127.7207 3133.9146 3140.1360 3150.9770 3155.2048 3164.2250 3168.0326 3205.0072 3542.2597
redmass: 3.9041 4.6471 4.1776 3.8919 5.7653 4.4119 3.1572 3.6715 2.5070 1.4304 2.0750 2.8052 1.7930 1.0960 3.3849 3.0879 3.0619 3.2257 4.7185 3.2664 3.6189 2.8356 2.8699 1.8810 2.0304 2.5161 3.2863 3.4874 4.1696 6.1847 6.4088 5.1720 2.0031 1.7154 6.2951 5.6227 1.8061 1.9060 4.2814 1.2454 1.2490 3.2222 1.6445 1.7135 1.7929 1.4803 1.3480 1.3958 4.2269 2.9389 2.4217 1.4556 1.6242 1.3530 2.4792 2.1737 1.6626 1.7058 1.9285 1.9978 1.4271 2.5575 2.1526 1.0544 1.1597 1.1202 1.1385 2.9753 3.4515 3.4350 2.7892 1.3499 1.5346 1.1976 7.3351 7.5153 1.2190 2.2373 1.4263 1.7130 1.1806 1.1094 1.2132 1.1729 1.7023 1.7713 1.1980 1.1909 1.1154 6.0642 6.1132 6.2568 6.1217 6.7751 1.0480 1.0368 1.0366 1.0852 1.0999 1.0989 1.1007 1.0977 1.0852 1.0847 1.0976 1.0889 1.0896 1.0932 1.0935 1.0958 1.0999 1.0985 1.0942 1.0768
irintensity: 0.1211 0.0883 0.8733 3.2377 7.2433 0.5975 1.1713 0.6933 0.3761 0.3118 3.5092 1.5522 2.0400 0.0619 2.8404 1.6245 1.4567 1.1393 7.5317 6.1904 0.5169 0.2217 2.8780 57.9291 8.7095 29.3791 14.1765 12.8722 16.5148 1.0866 0.2844 2.3163 49.6630 49.3048 3.6979 2.8723 81.4026 38.7590 3.3589 0.6789 0.2441 2.9728 5.2108 9.5076 4.2693 2.2971 0.7854 0.0129 1.4354 4.0423 21.7643 2.3443 6.0077 0.1420 20.3181 31.8499 0.9681 7.2702 80.5122 8.0470 18.7189 90.8313 4.9190 0.2259 5.0042 8.5790 0.6615 67.5157 35.6223 283.3762 181.0267 3.9475 77.0856 34.7149 11.3707 0.7519 51.4473 20.4321 5.3619 14.4563 152.8846 90.0408 188.3684 129.5276 11.2353 117.3463 8.5724 15.3268 9.9407 0.9851 5.2465 91.0149 10.4612 126.7038 60.8715 27.1838 30.2664 24.9982 35.0897 34.4369 19.8967 37.9382 4.0330 1.9170 3.4519 3.2836 15.3132 34.6863 39.3229 43.1285 19.5322 11.7647 8.9419 11.0522
temp: 298.150 k
press: 1.00000 atm
elementType: 8 7 7 6 6 6 6 6 6 6 6 6 6 6 6 6 6 6 6 6 1 1 1 1 1 1 1 1 1 1 1 1 1 1 1 1 1 1 1 1
symmnumber: 1
zpe: 870137.2 jmol-1
zpe.correction: 0.331418 hartree
zpe.thermalcorrener: 0.350363 hartree
zpe.thermalcorrenthalpy: 0.351307 hartree
zpe.thermalcorrgfe: 0.282881 hartree
zpe.sumelectzpe: -843.088221 hartree
zpe.sumelectthermal: -843.069276 hartree
zpe.sumelectthermalent: -843.068331 hartree
zpe.sumelectthermalfe: -843.136758 hartree
dipole: -0.5610 -3.1845 -2.9751
dipole: 4.3940
quadrupole: -109.7117 -110.1115 -118.2205
quadrupole: 1.4355 -5.9430 2.6662
quadrupole: 2.9696 2.5697 -5.5393 1.4355 -5.9430 2.6662
hfenergy: -843.4196386 hartree
pointgroup: C01 [X(C17H20N2O1)]
dipole: 0.1888083 1.3306731 -1.0872656 debye
polarizability: 261.5870285|14.84019|185.9592639|16.2009715|-4.6433845|149.5601809 unknown
InChI: InChI=1S/C17H20N2O/c1-17(2,14-10-6-4-7-11-14)18-16(20)19(3)15-12-8-5-9-13-15/h4-13,18H,1-3H3
charge 0 multiplicity 1
40 atoms
O  -0.218476 -0.175687 1.28676
N  0.651587 1.38581 -0.220281
N  -1.689278 1.062114 -0.110376
C  2.075856 1.323073 0.215066
C  2.755001 -0.017637 -0.172468
C  2.169658 1.579389 1.744493
C  2.78742 2.480074 -0.546487
C  4.102466 -0.256611 0.208099
C  2.093807 -1.004146 -0.942007
C  -0.401567 0.694913 0.383202
C  4.766632 -1.444213 -0.167394
C  2.754607 -2.195032 -1.320545
C  -2.844563 0.215139 0.041573
C  4.09481 -2.421783 -0.93711
C  -1.856008 2.324442 -0.861462
C  -2.992341 -0.696821 1.125436
C  -3.890604 0.306775 -0.921095
C  -4.157899 -1.485422 1.227552
C  -5.055144 -0.480487 -0.798116
C  -5.200034 -1.383896 0.277616
H  1.678881 2.537601 1.993777
H  1.677483 0.768368 2.301494
H  3.22533 1.641238 2.058803
H  2.34747 3.454742 -0.265676
H  2.705722 2.345766 -1.642349
H  3.860856 2.498725 -0.297452
H  0.485621 1.858377 -1.109597
H  4.645043 0.484368 0.807415
H  1.049752 -0.854707 -1.232078
H  5.805659 -1.606736 0.141504
H  2.21707 -2.94841 -1.907648
H  4.606427 -3.346127 -1.227815
H  -1.689014 2.215283 -1.954428
H  -1.160155 3.083254 -0.466911
H  -2.880733 2.701239 -0.712544
H  -2.19173 -0.783824 1.860037
H  -3.792808 0.970782 -1.785646
H  -4.251677 -2.180405 2.069937
H  -5.843701 -0.392109 -1.55427
H  -6.103125 -1.996321 0.372487
