program: Gaussian 09
title: 000092309
version: EM64L-G09RevD.01
frameworkgroup: C1[X(C16H27N)]
method: RPBEPBE
basis: SDD
operation: Freq
keyword: #pfreq=noraman
keyword: PBEPBE/SDD
title: #p freq=noraman PBEPBE/SDD
converged: YES YES NO NO
title: Mulliken charges:
elementType: N C C C C C C C C C C C C C C C C H H H H H H H H H H H H H H H H H H H H H H H H H H H
charge: -0.698695 -0.383598 -0.387945 -0.381567 -0.366589 -0.372703 -0.385189 -0.353185 -0.574472 -0.356677 0.523299 -0.696788 -0.403313 -0.413465 -0.416932 -0.414912 0.478479 0.192970 0.192115 0.193924 0.195083 0.192186 0.191568 0.190271 0.192165 0.188796 0.189382 0.206855 0.207738 0.187689 0.187350 0.200567 0.202016 0.194744 0.194520 0.209547 0.209625 0.214571 0.224830 0.225189 0.209834 0.209904 0.300400 0.300412
chargesum: 0.00000
title: Mulliken charges with hydrogens summed into heavy atoms:
elementType: N C C C C C C C C C C C C C C C C
charge: -0.097882 0.001486 0.001062 0.002187 0.015848 0.005476 0.029403 0.021854 -0.171888 0.032586 0.523299 -0.063045 -0.178482 -0.188276 -0.207098 -0.205007 0.478479
polarizability: 2.53430917e+02 -2.56148687e+01 1.42056489e+02 -8.04616671e+00 -7.44693770e+00 1.56926306e+02
1716.lowfreq: -16.8625 -7.7153 -0.0008 0.0003 0.0008 4.6501 7.8964 18.2283 25.4852
frequency: -0.5674 18.1582 25.2621 30.8906 56.9231 62.1525 72.7718 107.7183 113.5604 115.5845 143.3335 143.8518 144.9659 195.4365 221.1637 244.1734 293.2438 307.3372 325.7408 340.9515 354.7211 392.5870 409.0274 413.5313 448.8599 482.2378 505.6469 550.0907 639.5595 719.5235 722.6742 725.0347 731.1164 749.5767 770.3519 785.3815 815.1426 821.2346 834.0909 837.0827 886.3868 898.0150 932.5337 950.3752 960.1445 979.5419 997.8831 1000.8748 1008.6489 1016.2420 1019.6776 1051.5280 1059.5877 1073.9994 1078.3371 1079.8838 1082.1855 1120.9415 1133.7323 1182.9072 1186.7495 1203.5194 1208.2253 1218.4056 1237.8515 1238.8724 1264.7782 1268.9876 1277.0557 1282.4401 1285.5347 1292.4738 1294.2295 1298.5725 1308.8817 1320.1823 1323.2345 1339.0665 1348.9664 1352.5389 1353.6583 1384.2240 1385.2986 1432.4057 1459.2816 1459.6306 1463.0055 1463.6505 1466.9441 1471.8119 1474.9167 1477.3226 1482.7981 1487.2961 1489.2611 1519.0921 1582.5748 1631.9666 1643.8002 2947.1735 2948.0377 2949.5302 2950.7752 2955.3510 2961.1559 2963.6230 2967.5457 2970.6869 2972.8628 2981.2021 2984.4833 2990.3907 2999.6172 3008.0220 3016.4742 3027.9707 3038.2702 3045.2179 3067.2757 3069.7004 3103.6463 3105.6387 3126.1909 3133.4618 3570.0828 3710.8127
redmass: 3.2036 3.5866 3.6708 1.9064 3.9274 2.7334 1.7037 2.2653 2.0473 3.0112 2.6679 3.2481 1.9004 3.6805 1.1302 3.5684 2.4914 1.2185 3.7389 3.9968 1.0462 2.5139 2.7227 3.4699 3.5792 2.9630 3.3749 2.7291 6.6181 1.0596 1.0713 3.3212 1.0898 1.1321 3.8177 1.1900 1.2610 2.1221 3.7997 1.2509 1.8938 1.2501 1.4170 1.3582 1.2216 5.2076 3.8416 2.8874 1.3499 3.9556 1.1746 3.1475 3.0292 2.5140 1.2395 2.0732 2.2713 2.7375 1.1947 1.8550 1.0960 1.2685 1.5483 2.2447 1.3458 1.3816 1.2814 1.3333 1.0343 1.1280 1.0911 1.1053 1.1171 1.3517 3.0764 1.2525 1.4288 1.4761 1.6089 1.6771 1.6473 5.4741 1.2167 3.1955 1.0737 1.0726 1.0688 1.0716 1.0815 1.0833 1.0430 1.0848 1.0903 1.0943 1.0969 3.1060 6.6565 1.8195 2.1388 1.0586 1.0585 1.0589 1.0592 1.0593 1.0589 1.0589 1.0586 1.0364 1.0592 1.0960 1.0974 1.0994 1.1013 1.1020 1.1041 1.1050 1.1049 1.1046 1.1007 1.0992 1.0865 1.0865 1.0962 1.0971 1.0447 1.1040
irintensity: 0.0115 0.2221 0.2185 0.0565 0.6161 0.1332 0.0382 0.0222 0.3699 1.1402 0.6435 0.9444 0.0230 1.0030 0.0034 2.0539 2.0821 309.8023 0.9197 9.6896 0.9756 1.2532 0.0211 0.2906 0.1234 1.1802 9.4515 20.1512 0.2082 16.2866 0.2120 0.4435 4.7890 0.0757 8.4313 0.9768 0.1283 59.0769 15.5347 1.0699 4.9294 0.5514 0.1597 0.0187 0.3045 0.1293 1.1840 0.2176 0.2173 0.3604 0.0091 0.7842 1.6249 0.0018 0.8836 0.0170 0.4153 16.9732 19.5176 0.5262 16.9090 17.9365 0.2164 0.3371 0.2805 0.4369 0.5342 0.4550 0.0761 0.1940 0.0312 0.0210 0.3167 0.4829 67.7008 0.4099 3.5205 1.1207 0.2904 0.1603 0.6104 9.7458 11.0816 0.3280 0.0408 0.0097 0.0363 0.1307 0.2473 0.5176 12.2686 1.5528 0.6228 1.6239 38.2680 149.5425 3.3017 2.9863 264.6404 2.0236 0.2535 3.0678 1.0861 0.3154 55.5088 2.3531 139.5078 37.2699 148.7374 0.2459 0.5305 0.5263 0.7533 1.3915 0.3338 1.2430 52.9830 223.7062 100.4559 56.5501 2.1391 41.9197 55.9532 2.4292 64.7095 18.5525
temp: 298.150 k
press: 1.00000 atm
elementType: 7 6 6 6 6 6 6 6 6 6 6 6 6 6 6 6 6 1 1 1 1 1 1 1 1 1 1 1 1 1 1 1 1 1 1 1 1 1 1 1 1 1 1 1
symmnumber: 1
zpe: 1031353.4 jmol-1
zpe.correction: 0.392822 hartree
zpe.thermalcorrener: 0.412359 hartree
zpe.thermalcorrenthalpy: 0.413303 hartree
zpe.thermalcorrgfe: 0.342040 hartree
zpe.sumelectzpe: -679.320960 hartree
zpe.sumelectthermal: -679.301423 hartree
zpe.sumelectthermalent: -679.300479 hartree
zpe.sumelectthermalfe: -679.371743 hartree
dipole: 1.5439 -0.8742 -0.2067
dipole: 1.7862
quadrupole: -85.2037 -108.4362 -100.9580
quadrupole: -12.0557 -3.3089 -3.0234
quadrupole: 12.9956 -10.2369 -2.7587 -12.0557 -3.3089 -3.0234
hfenergy: -679.7137822 hartree
pointgroup: C01 [X(C16H27N1)]
dipole: -0.6076245 -0.3517979 0.0300462 debye
polarizability: 253.4592925|26.4523711|140.1700871|-4.239175|4.9321423|158.7843329 unknown
InChI: InChI=1S/C16H27N/c1-2-3-4-5-6-7-8-9-10-15-11-13-16(17)14-12-15/h11-14H,2-10,17H2,1H3
charge 0 multiplicity 1
44 atoms
N  -7.280846 -1.366145 0.10874
C  2.98276 0.661526 -0.048438
C  1.595425 -0.012323 0.048833
C  4.158098 -0.335458 0.065936
C  0.420375 0.984338 -0.071533
C  5.545384 0.337201 -0.040356
C  -0.965369 0.307076 0.009859
C  6.721024 -0.660094 0.068214
C  -2.142591 1.313761 -0.121265
C  8.108282 0.012876 -0.042675
C  -3.507828 0.644505 -0.063971
C  9.276656 -0.991297 0.062708
C  -4.106754 0.095802 -1.227532
C  -4.212522 0.500622 1.158725
C  -5.348403 -0.569036 -1.181827
C  -5.45565 -0.160757 1.226886
C  -6.045753 -0.710239 0.052656
H  3.074438 1.42918 0.748478
H  3.05801 1.205948 -1.013286
H  1.505231 -0.7812 -0.746918
H  1.517592 -0.555196 1.014082
H  4.086156 -0.876832 1.032645
H  4.062976 -1.1056 -0.728167
H  0.503506 1.533453 -1.033427
H  0.503929 1.749119 0.729375
H  5.61539 0.880787 -1.006104
H  5.642189 1.105557 0.755341
H  -1.054759 -0.457352 -0.788702
H  -1.062004 -0.237292 0.971213
H  6.654437 -1.202665 1.03473
H  6.624186 -1.429709 -0.72627
H  -2.027482 1.862645 -1.077874
H  -2.053658 2.066655 0.687429
H  8.205094 0.780398 0.752373
H  8.172767 0.556295 -1.007662
H  9.218976 -1.750608 -0.740129
H  9.253148 -1.526355 1.03103
H  10.256391 -0.485457 -0.020225
H  -3.59236 0.195224 -2.192377
H  -3.781564 0.918421 2.077918
H  -5.786686 -0.977179 -2.10162
H  -5.977434 -0.250077 2.188333
H  -7.701131 -1.756264 -0.728981
H  -7.778124 -1.464353 0.988333
