program: Gaussian 09
title: 000092400
version: EM64L-G09RevD.01
frameworkgroup: C1[X(C22H23NO4S2)]
method: RPBEPBE
basis: SDD
operation: Freq
keyword: #p
keyword: freq=noraman
keyword: PBEPBE/SDD
title: #p freq=noraman PBEPBE/SDD
converged: YES YES NO NO
title: Mulliken charges:
elementType: S S O O O O N C C C C C C C C C C C C C C C C C C C C C C H H H H H H H H H H H H H H H H H H H H H H H
charge: 0.205890 0.188639 -0.282106 -0.426052 -0.198277 -0.204752 -0.149540 -0.160064 -0.514036 -0.459135 -0.349928 0.255721 -0.144393 0.184093 -0.727447 -0.708404 -0.170320 -0.250309 -0.253699 -0.210796 -0.220424 -0.232055 -0.226739 0.393161 -0.367798 -0.299692 -0.223918 -0.241752 -0.224578 0.288704 0.309134 0.241050 0.294212 0.272858 0.253449 0.271840 0.282384 0.289698 0.235280 0.209070 0.238787 0.384123 0.255611 0.264732 0.232867 0.232797 0.233378 0.267625 0.264854 0.231687 0.233043 0.231522
chargesum: 0.00000
title: Mulliken charges with hydrogens summed into heavy atoms:
elementType: S S O O O O N C C C C C C C C C C C C C C C C C C C C C C
charge: 0.205890 0.188639 -0.282106 -0.041929 -0.198277 -0.204752 -0.149540 0.128640 -0.204902 0.076127 0.176378 0.255721 0.127447 0.184093 -0.155364 -0.025267 -0.170320 0.005302 0.011033 0.022071 0.012373 -0.232055 0.006639 0.393161 -0.100172 -0.034838 0.007769 -0.008709 0.006944
polarizability: 3.10748228e+02 2.13139162e+00 3.17650416e+02 -1.13344690e+01 1.47137618e+01 2.34900224e+02
1716.lowfreq: -9.9931 -5.1566 -2.7815 -0.0016 -0.0015 -0.0013 10.5162 17.1124 22.2298
frequency: 10.1864 17.0931 22.2123 23.5408 26.8279 31.9211 47.7027 57.2744 67.2188 72.2564 76.2665 82.3978 93.1682 110.3064 129.3810 131.4467 186.0816 194.2482 214.3438 222.5628 231.5997 252.4362 271.4141 278.0648 286.2744 307.8565 323.4498 366.6493 373.2773 384.7169 391.7587 397.0991 400.4632 407.4546 426.9719 442.7079 491.1042 501.4365 525.7618 557.8874 573.4605 592.7780 611.0492 612.2204 632.8676 642.4900 657.9283 671.1593 678.6536 687.4598 695.5967 699.8964 716.0469 738.6134 759.1541 782.5900 798.4304 842.6588 855.9732 857.4918 875.0001 884.9167 897.2343 918.8207 929.4250 931.1173 943.7937 968.1658 981.6937 986.2807 986.3306 989.7587 1000.3080 1002.9760 1005.9723 1009.0580 1015.3876 1026.0332 1035.4550 1043.1016 1060.2762 1069.9501 1074.2607 1084.7648 1085.5772 1132.9619 1159.0402 1172.3206 1173.3153 1175.2406 1182.0574 1182.9030 1186.9915 1195.6970 1202.9303 1212.2759 1242.7628 1258.9321 1266.2073 1267.1514 1293.3835 1299.2460 1303.4129 1318.0083 1319.2361 1332.9708 1341.4104 1371.6084 1377.5762 1385.3755 1395.4972 1407.8273 1424.7163 1434.6722 1456.6939 1461.1821 1471.7954 1474.8118 1481.1205 1484.6537 1571.2591 1580.5124 1584.6668 1587.3005 1595.1149 1607.4576 1669.5968 2978.9117 3003.8851 3007.2084 3024.2141 3039.4486 3043.3175 3056.4070 3073.2309 3081.4294 3091.7908 3112.3258 3125.4952 3127.6435 3128.6502 3135.5687 3140.8467 3147.3195 3152.2587 3155.4912 3162.1668 3168.1454 3170.9524 3513.8938
redmass: 6.3544 5.6624 4.6173 6.1547 5.0051 5.0904 6.5352 7.8096 6.4202 5.4427 7.6596 7.3640 7.1605 6.8516 6.2064 4.5733 5.4768 4.6452 1.1984 2.9536 3.7150 3.9913 4.9311 2.6647 5.6850 3.3699 5.1078 3.2413 5.6512 5.0767 6.8771 5.0993 2.8946 2.8405 4.8293 4.9772 3.4373 3.2618 7.3006 3.4064 4.5073 2.6886 6.4019 6.4131 5.0279 2.0734 3.0576 7.2870 6.7135 5.5378 1.7558 2.2333 4.9735 3.4250 1.5935 1.9016 3.7290 5.4177 1.2412 1.2472 2.3449 3.0705 2.6544 2.1184 2.4583 1.3747 1.4387 2.1600 1.5708 2.9913 2.0271 3.3306 1.3212 1.3333 2.1134 2.1267 3.3164 2.1488 2.1749 2.1715 2.2449 1.6475 2.2681 1.7385 1.5759 1.8812 1.3714 1.0546 1.0620 1.0951 1.1138 1.3215 1.1630 1.5808 2.8337 3.4508 1.2563 1.4980 1.2919 1.6238 1.4538 1.3239 1.3566 1.3174 1.6128 1.4647 1.6364 9.4556 1.3402 8.9446 1.3040 2.0195 2.0789 2.2533 1.7129 1.2271 1.0473 2.2019 1.0710 1.0756 8.3426 8.5331 6.2625 6.0104 7.4869 5.9902 9.4895 1.0352 1.0604 1.0693 1.0824 1.0697 1.0714 1.1036 1.0984 1.0894 1.1011 1.0966 1.1074 1.0849 1.0853 1.0882 1.0886 1.0927 1.0928 1.0969 1.0962 1.1018 1.1010 1.0642
irintensity: 0.1847 0.4884 0.6929 0.3396 0.3446 0.7203 1.7300 0.7831 0.1460 0.2272 2.2586 0.8340 2.3077 0.4312 0.8326 0.8184 0.7457 2.5691 0.2658 3.7159 0.1028 8.6671 3.4226 2.5742 5.3145 17.5882 1.8184 3.0813 5.1390 1.9695 1.6188 3.6444 0.5237 0.1486 2.2374 3.5981 12.6422 17.5191 1.0449 43.3106 2.3984 25.9302 0.3275 0.6765 25.9079 91.7633 21.7344 52.0455 4.9897 6.5868 61.5405 39.5342 10.1502 3.8485 66.8086 44.2277 3.5273 35.2163 0.8571 1.4173 41.6561 75.8950 30.9938 6.9677 14.7565 2.4015 6.8978 11.5970 0.3128 2.9573 1.7957 0.0290 1.1993 0.6101 6.8014 131.6745 7.9818 2.7423 26.7401 74.8710 5.4647 6.2685 1.3021 1.3208 10.1751 18.9168 1.0330 0.0328 2.0949 2.8925 2.2423 6.9714 42.0324 8.9724 6.5294 139.2730 47.8752 1.6054 13.9600 5.7774 30.5988 0.9922 0.9699 2.7253 60.6019 13.2310 13.2020 0.6889 30.6990 2.5687 4.6493 210.4787 9.9190 13.8449 16.9996 23.2257 13.3460 5.0001 22.7107 14.2519 98.7684 247.3265 0.9243 3.7284 43.7767 10.6466 217.4206 30.6935 17.3766 16.2452 10.7593 3.9968 16.1910 5.6608 47.4896 16.6141 17.5188 3.1965 0.3369 0.2717 0.2776 3.8604 9.0268 12.4437 17.9413 21.2929 18.4763 23.5076 17.3234 20.9690
temp: 298.150 k
press: 1.00000 atm
elementType: 16 16 8 8 8 8 7 6 6 6 6 6 6 6 6 6 6 6 6 6 6 6 6 6 6 6 6 6 6 1 1 1 1 1 1 1 1 1 1 1 1 1 1 1 1 1 1 1 1 1 1 1
symmnumber: 1
zpe: 1058871.5 jmol-1
zpe.correction: 0.403303 hartree
zpe.thermalcorrener: 0.431836 hartree
zpe.thermalcorrenthalpy: 0.432780 hartree
zpe.thermalcorrgfe: 0.338242 hartree
zpe.sumelectzpe: -2001.823794 hartree
zpe.sumelectthermal: -2001.795261 hartree
zpe.sumelectthermalent: -2001.794317 hartree
zpe.sumelectthermalfe: -2001.888855 hartree
dipole: 4.8340 2.4508 3.6230
dipole: 6.5192
quadrupole: -165.2988 -171.5270 -186.8257
quadrupole: -11.5406 0.6482 -4.7281
quadrupole: 9.2517 3.0235 -12.2752 -11.5406 0.6482 -4.7281
hfenergy: -2002.2270969 hartree
pointgroup: C01 [X(C22H23N1O4S2)]
dipole: 2.0583409 -0.6310531 -1.3940853 debye
polarizability: 310.775842|-4.0620433|315.1558419|11.4759831|19.9871619|237.3671839 unknown
InChI: InChI=1S/C22H23NO4S2/c1-15(14-28-22(27)16-8-4-2-5-9-16)20(24)23-13-18(12-19(23)21(25)26)29-17-10-6-3-7-11-17/h2-11,15,18-19,25H,12-14H2,1H3
charge 0 multiplicity 1
52 atoms
S  2.923216 0.16323 1.483345
S  -3.650041 0.662504 1.056086
O  -1.28791 3.370645 1.635121
O  1.033948 -0.750555 -1.738466
O  -0.394916 -0.57612 0.087316
O  -3.973877 0.032517 -1.591274
N  0.239778 2.226339 0.345016
C  0.729029 1.464991 -0.814996
C  2.588864 1.884881 0.695329
C  2.251429 1.769796 -0.806887
C  1.317523 2.486686 1.338426
C  -1.038636 2.705634 0.57975
C  -2.107249 2.492206 -0.508801
C  0.393988 -0.037785 -0.709456
C  -3.492501 2.304394 0.137171
C  -2.12755 3.740897 -1.437725
C  4.547978 -0.221927 0.689603
C  5.746603 0.223942 1.29638
C  4.59296 -0.99492 -0.495333
C  6.992699 -0.097291 0.709923
C  5.842545 -1.316651 -1.0758
C  -3.831078 -0.43909 -0.432017
C  7.041962 -0.866996 -0.476342
C  -3.834355 -1.900034 -0.128497
C  -4.465702 -2.771831 -1.057486
C  -3.212013 -2.436316 1.029087
C  -4.498158 -4.159915 -0.815532
C  -3.244533 -3.826908 1.26449
C  -3.890203 -4.690413 0.348168
H  0.272727 1.816017 -1.758832
H  3.489585 2.487294 0.887197
H  2.420338 2.748097 -1.296124
H  2.844908 1.009966 -1.335696
H  1.064214 2.035568 2.31416
H  1.41593 3.575808 1.501531
H  -1.887138 1.599464 -1.118857
H  -4.279584 2.310639 -0.634108
H  -3.674583 3.075678 0.902479
H  -2.883055 3.613559 -2.233223
H  -1.145398 3.902098 -1.920401
H  -2.372054 4.648164 -0.856993
H  0.737404 -1.700401 -1.702121
H  5.700051 0.804648 2.223857
H  3.659185 -1.341642 -0.950891
H  7.919839 0.246003 1.182011
H  5.8768 -1.917344 -1.991456
H  8.008561 -1.119403 -0.926358
H  -4.926009 -2.342002 -1.953317
H  -2.683012 -1.77134 1.719293
H  -4.996262 -4.827324 -1.527359
H  -2.757683 -4.238515 2.155118
H  -3.91506 -5.769742 0.536393
