program: Gaussian 09
title: 000092283
version: EM64L-G09RevD.01
frameworkgroup: C1[X(C6H8O6)]
method: RPBEPBE
basis: SDD
operation: Freq
keyword: #p
keyword: freq=noraman
keyword: PBEPBE/SDD
title: #p freq=noraman PBEPBE/SDD
converged: YES YES NO NO
title: Mulliken charges:
elementType: O O O O O O C C C C C C H H H H H H H H
charge: -0.205130 -0.443969 -0.402356 -0.429060 -0.147812 -0.190192 -0.100383 -0.225089 -0.194361 -0.125014 0.143853 -0.095810 0.282009 0.295236 0.276723 0.239289 0.358956 0.239235 0.358632 0.365244
chargesum: 0.00000
title: Mulliken charges with hydrogens summed into heavy atoms:
elementType: O O O O O O C C C C C C
charge: -0.205130 -0.085013 -0.043723 -0.063816 -0.147812 -0.190192 0.181626 0.070147 0.082362 0.114275 0.143853 0.143425
polarizability: 1.07240924e+02 4.30978296e+00 7.48581502e+01 6.51128985e+00 1.90936127e-01 6.09366511e+01
1716.lowfreq: -17.4902 -10.2631 0.0003 0.0004 0.0007 9.7569 50.3173 75.6114 101.1768
frequency: 50.2136 75.6060 101.1640 108.8377 147.1236 219.3225 245.3405 261.4499 272.9521 314.6166 326.6909 393.0006 421.8374 468.7756 484.0105 491.0700 547.4455 598.9023 706.1374 724.8814 747.5970 792.2661 805.1861 853.0529 893.5917 925.0245 972.9493 1008.9498 1041.5619 1063.8142 1085.3446 1113.3207 1176.2374 1191.9467 1217.5701 1231.2835 1261.3269 1274.7939 1289.4821 1323.2755 1333.1399 1358.3503 1368.5971 1369.9888 1619.6471 1731.5894 2946.7242 2988.7087 3033.8548 3040.3084 3108.4354 3418.8394 3503.0124 3515.9804
redmass: 8.6335 6.7983 6.1415 11.0022 3.9154 4.7639 5.0080 6.8201 5.1279 6.8642 5.6507 1.2170 1.5670 3.4939 1.5707 1.6892 3.8557 7.7196 6.4637 5.4033 4.5264 3.9168 3.4263 3.1181 4.6149 3.9713 2.0488 4.6413 3.7139 3.2527 2.8899 2.5830 1.3114 1.4475 1.5612 1.4308 1.2077 1.5108 1.4540 1.2554 1.2127 1.1747 1.1875 1.4078 8.3653 12.7978 1.0805 1.0912 1.0836 1.0856 1.0892 1.0647 1.0652 1.0659
irintensity: 2.0705 3.1391 0.6501 2.5636 4.2842 27.2383 6.9148 11.1878 26.8257 23.6415 13.5965 88.2795 65.4995 33.3119 92.5436 62.5068 10.1490 12.9407 12.2486 6.6286 6.6877 15.7719 54.5801 66.9594 22.3531 180.3028 60.1064 199.7122 43.6231 2.6201 72.0027 53.2656 28.0146 34.2533 17.6943 21.5473 4.7455 12.1460 7.1324 61.6028 16.3605 16.1024 53.4009 12.7652 125.4241 300.0269 15.3857 31.9568 5.2533 12.8612 11.1856 38.4465 22.6159 7.7895
temp: 298.150 k
press: 1.00000 atm
elementType: 8 8 8 8 8 8 6 6 6 6 6 6 1 1 1 1 1 1 1 1
symmnumber: 1
zpe: 374222.6 jmol-1
zpe.correction: 0.142534 hartree
zpe.thermalcorrener: 0.154469 hartree
zpe.thermalcorrenthalpy: 0.155413 hartree
zpe.thermalcorrgfe: 0.104285 hartree
zpe.sumelectzpe: -683.793689 hartree
zpe.sumelectthermal: -683.781754 hartree
zpe.sumelectthermalent: -683.780810 hartree
zpe.sumelectthermalfe: -683.831938 hartree
dipole: -1.9787 -3.2579 -0.1425
dipole: 3.8144
quadrupole: -91.5659 -81.9648 -61.4343
quadrupole: -3.7730 -1.0234 -3.6825
quadrupole: -13.2442 -3.6432 16.8874 -3.7730 -1.0234 -3.6825
hfenergy: -683.9362231 hartree
pointgroup: C01 [X(C6H8O6)]
dipole: 0.8165323 1.2570798 -0.0717598 debye
dipolederiv: -1.5299432 -0.1681007 0.0759689 0.1550445 -0.418337 0.0301069 -0.1029944 0.0459685 -0.2781629 -0.651138 0.1253162 -0.0572511 0.0862286 -0.2993345 -0.1901848 -0.0885474 -0.256374 -0.6054229 -0.6325113 0.1785116 0.1203017 0.1573409 -0.627853 0.036652 0.1806073 -0.0056791 -0.2530263 -0.5383395 0.2232966 -0.0643079 0.2997659 -0.5483967 -0.0476188 -0.050219 -0.0517221 -0.4910587 -1.0430391 -0.2244246 0.0941627 -0.3451752 -0.5601366 0.1119562 0.2440062 0.1765476 -0.3527615 -0.9076765 -0.1555536 0.10591 -0.0494276 -0.4410467 -0.0253792 0.2504459 0.0353006 -0.3223045 0.6547339 0.2466112 -0.01347 0.289799 0.236898 -0.047813 -0.1665147 0.0454059 0.2137802 0.1232954 0.0955621 -0.0097514 -0.0465869 0.1718695 0.0806768 0.0692532 0.1714865 0.5193686 0.3014285 -0.2670318 -0.06255 -0.186822 0.3273343 0.1181207 -0.0648602 0.1794733 0.182429 0.1028272 -0.4684759 0.0219296 -0.5133228 0.1389646 0.0780245 0.0258467 0.125699 0.315356 1.952571 0.3048636 -0.1562159 -0.0015141 0.6339071 -0.2344478 -0.0943338 -0.3034677 0.2899206 0.9700592 0.2378312 -0.2247531 0.4009431 0.5677293 0.0339626 -0.3756489 -0.0115107 0.1559585 -0.0121804 -0.0201283 0.0245475 -0.0451403 0.0350635 -0.0389322 0.0417144 -0.0103703 -0.0651514 0.0650307 -0.0659916 0.0561444 -0.0747219 -0.0152058 0.0469349 0.0374015 0.0028801 -0.0019743 0.0901448 0.0049841 0.0012495 0.0196014 0.0386105 -0.0305882 0.0198681 -0.059778 -0.0399234 0.0332904 0.0314265 0.0750998 0.0101044 0.0392832 -0.0293564 0.0539457 -0.0766921 -0.0787508 0.3524237 -0.0674959 0.0227675 -0.0621729 0.1181446 0.1394921 0.0247449 0.110632 0.2581302 0.0783119 0.0558626 0.046078 0.0548643 -0.1012228 -0.0471698 0.044279 -0.0594628 0.0931341 0.372782 -0.0531542 -0.0985251 -0.0148245 0.3302021 -0.0233837 -0.0836456 -0.0566202 0.1360291 0.2179294 -0.013909 0.0426652 -0.1339838 0.3735264 0.0389474 0.0346512 -0.0017166 0.3244304 unknown
polarizability: 107.7593652|3.2067354|74.6284197|-5.4417408|-0.3187329|60.6479406 unknown
InChI: InChI=1S/C6H8O6/c7-1-2(8)5-3(9)4(10)6(11)12-5/h1-5,8-10H
charge 0 multiplicity 1
20 atoms
O  -0.62266 -1.337076 0.264729
O  -0.408043 1.622977 1.013304
O  -2.867405 1.485831 -0.358546
O  2.406151 -1.638184 0.086532
O  -2.947433 -1.453822 0.452211
O  3.713398 0.708302 -0.135735
C  0.363549 -0.36478 -0.330487
C  -0.402304 0.974908 -0.314751
C  -1.842737 0.529173 -0.677805
C  1.676114 -0.454079 0.476909
C  -1.952353 -0.84214 0.059704
C  2.542856 0.805399 0.306229
H  0.574258 -0.68217 -1.368134
H  0.006694 1.732279 -0.998301
H  -1.927711 0.339658 -1.763759
H  1.411695 -0.518014 1.556153
H  -0.585856 0.942512 1.71655
H  2.101292 1.77286 0.626603
H  -2.625926 1.923762 0.501719
H  3.321521 -1.347095 -0.191126
